program: Orca
programVersion: 5.0.2
elementType: Cl Cl O O O C C C C C C C C C C C C C C C C C C C C C H H H H H H H H H H H H H H H H H H H H
charge: 0
multiplicity: 1
keywords: wb97x-d3
keywords: def2-TZVPP
keywords: def2/J RIJCOSX
keywords: DEFGRID2
keywords: scfconv7
keywords: smallprint printgap noloewdin
keywords: NOSOSCF
formula: C21H20Cl2O3
InChI: InChI=1/C21H20Cl2O3/c1-21(2)17(12-18(22)23)19(21)20(24)25-13-14-7-6-10-16(11-14)26-15-8-4-3-5-9-15/h3-12,17,19H,13H2,1-2H3
46 atoms
Cl -0.170963 2.758223 2.2127
Cl 0.225323 -0.057386 2.705701
O  0.077309 1.796561 -0.936115
O  -0.200473 3.870732 -1.714986
O  2.128643 -2.944361 -0.274113
C  -3.007094 1.678242 -0.993826
C  -2.53652 1.879535 0.410532
C  -2.037951 2.803255 -0.685703
C  -4.415148 2.112734 -1.327289
C  -2.568336 0.458036 -1.767338
C  -1.698153 0.87108 1.094934
C  -0.638808 2.891804 -1.17288
C  -0.691183 1.153406 1.906317
C  1.471886 1.824448 -1.239265
C  2.110422 0.718465 -0.454742
C  1.80649 -0.604601 -0.755294
C  2.985751 1.004796 0.582705
C  2.369313 -1.62939 -0.009986
C  3.566571 -0.027921 1.304634
C  3.257336 -1.345214 1.020022
C  0.896091 -3.338186 -0.706793
C  -0.2740 -2.878299 -0.113341
C  0.845904 -4.268323 -1.734277
C  -1.494904 -3.352566 -0.566025
C  -0.382652 -4.742107 -2.169237
C  -1.557543 -4.28294 -1.593873
H  -3.244472 2.366711 1.077285
H  -2.487787 3.789149 -0.682403
H  -4.722802 2.982489 -0.745733
H  -4.502498 2.373508 -2.383113
H  -5.125808 1.310074 -1.121843
H  -3.280542 -0.354436 -1.609224
H  -2.552994 0.670685 -2.83752
H  -1.585062 0.088127 -1.488348
H  -1.942293 -0.175237 0.952669
H  1.614265 1.688377 -2.314854
H  1.901165 2.790886 -0.970985
H  1.129484 -0.831554 -1.570553
H  3.213613 2.033846 0.828786
H  4.252589 0.196352 2.110278
H  3.695303 -2.156694 1.586059
H  -0.228751 -2.16476 0.699937
H  1.766882 -4.61861 -2.181391
H  -2.40606 -2.997993 -0.101589
H  -0.418143 -5.469934 -2.969015
H  -2.514136 -4.65058 -1.938869
totalener: -1958.41718654 hartree
nucrepener: 2749.63701750 hartree
electener: -4708.05420404 hartree
oneelecener: -8152.33812794 hartree
twoeener: 3444.28392391 hartree
kineticenergy: 1952.65032369 hartree
xcener: -143.522206918009 hartree
chargesum: -0.0000000
charge: -0.047483 -0.046483 -0.253705 -0.356549 -0.300088 0.106005 -0.022728 -0.125759 -0.243343 -0.257159 -0.171770 0.337127 0.098055 0.015051 0.049724 -0.180796 -0.190154 0.240936 -0.073278 -0.215949 0.236960 -0.141890 -0.194870 -0.144824 -0.102863 -0.123502 0.102896 0.088973 0.074683 0.095223 0.085618 0.086483 0.100893 0.069939 0.101832 0.113006 0.102247 0.119910 0.108425 0.124001 0.124367 0.111514 0.126021 0.122934 0.125861 0.124508
qa: -0.0475 -0.0465 -0.2537 -0.3565 -0.3001 0.1060 -0.0227 -0.1258 -0.2433 -0.2572 -0.1718 0.3371 0.0981 0.0151 0.0497 -0.1808 -0.1902 0.2409 -0.0733 -0.2159 0.2370 -0.1419 -0.1949 -0.1448 -0.1029 -0.1235 0.1029 0.0890 0.0747 0.0952 0.0856 0.0865 0.1009 0.0699 0.1018 0.1130 0.1022 0.1199 0.1084 0.1240 0.1244 0.1115 0.1260 0.1229 0.1259 0.1245
va: 1.2867 1.2732 2.0787 2.1488 2.1145 3.7149 3.8213 3.8878 3.9189 3.9203 3.8788 4.2183 4.1978 3.8655 3.6430 3.9109 3.9803 3.8079 3.9234 4.0287 3.8299 3.8834 4.0260 3.9382 3.9473 3.9517 1.0097 1.0316 1.0083 1.0035 1.0040 1.0024 1.0069 1.0087 1.0061 0.9970 1.0142 1.0133 1.0158 0.9989 1.0131 1.0407 1.0134 1.0004 0.9987 1.0003
dispcorr: -0.030490156 hartree
energy: -1958.447676690984
dipole: -16.09436 15.26691 -0.82744 -7.64079 6.92845 -0.71234 -21.50343 21.40026 -0.10317
magnitude: 1.09669 au
magnitude: 2.78757 debye
