program: Orca
programVersion: 5.0.2
elementType: Cl Cl O O O C C C C C C C C C C C C C C C C C C C C C H H H H H H H H H H H H H H H H H H H H
charge: 0
multiplicity: 1
keywords: wb97x-d3
keywords: def2-TZVPP
keywords: def2/J RIJCOSX
keywords: DEFGRID2
keywords: scfconv7
keywords: smallprint printgap noloewdin
keywords: NOSOSCF
formula: C21H20Cl2O3
InChI: InChI=1/C21H20Cl2O3/c1-21(2)17(12-18(22)23)19(21)20(24)25-13-14-7-6-10-16(11-14)26-15-8-4-3-5-9-15/h3-12,17,19H,13H2,1-2H3
46 atoms
Cl -3.808568 -1.190625 -0.082782
Cl -2.074161 -1.544443 -2.355119
O  0.629858 2.334998 -0.555472
O  1.281001 2.790838 1.530201
O  2.467584 -2.319183 0.036399
C  -2.237464 2.733861 0.513647
C  -1.981758 1.254773 0.595211
C  -0.981469 2.234534 1.19367
C  -3.29179 3.295268 1.439224
C  -2.199609 3.437158 -0.820888
C  -1.719868 0.436666 -0.59755
C  0.415746 2.480396 0.76021
C  -2.43796 -0.62222 -0.950917
C  1.974304 2.452434 -1.009003
C  2.814958 1.258078 -0.646282
C  2.231662 0.010626 -0.486378
C  4.190575 1.394298 -0.507958
C  3.014343 -1.085927 -0.151737
C  4.969409 0.285015 -0.217056
C  4.389472 -0.958997 -0.025426
C  1.231233 -2.399152 0.619149
C  0.936357 -1.706789 1.788007
C  0.283491 -3.217961 0.026219
C  -0.317549 -1.845537 2.360211
C  -0.965123 -3.354612 0.615069
C  -1.27164 -2.669808 1.780485
H  -2.552528 0.734097 1.356095
H  -1.021027 2.275678 2.275877
H  -4.281526 3.216935 0.986411
H  -3.321652 2.767331 2.392953
H  -3.101987 4.34925 1.649501
H  -3.187705 3.389097 -1.28103
H  -1.948354 4.49082 -0.689025
H  -1.491672 3.014544 -1.526445
H  -0.907257 0.703854 -1.256945
H  1.889401 2.542443 -2.093156
H  2.431534 3.36922 -0.630535
H  1.163371 -0.118534 -0.599862
H  4.654166 2.36719 -0.613867
H  6.040278 0.394497 -0.108156
H  4.988942 -1.822123 0.231467
H  1.676764 -1.062822 2.245664
H  0.525708 -3.740475 -0.889692
H  -0.545375 -1.30683 3.270766
H  -1.706726 -3.989084 0.148155
H  -2.249418 -2.772752 2.230197
totalener: -1958.41963059 hartree
nucrepener: 2736.20114654 hartree
electener: -4694.62077713 hartree
oneelecener: -8125.54672605 hartree
twoeener: 3430.92594893 hartree
kineticenergy: 1952.62487610 hartree
xcener: -143.521098752288 hartree
chargesum: 0.0000000
charge: -0.056455 -0.051655 -0.293967 -0.341477 -0.302359 0.092863 0.061965 -0.099161 -0.240219 -0.246468 -0.256720 0.323753 0.069700 0.026259 0.093574 -0.155435 -0.195237 0.201937 -0.084339 -0.206341 0.242842 -0.146490 -0.183818 -0.140690 -0.129371 -0.128855 0.077322 0.092779 0.091005 0.074045 0.092824 0.092193 0.096112 0.090756 0.123124 0.104330 0.111722 0.097365 0.104949 0.123298 0.125781 0.136522 0.124767 0.126036 0.131865 0.129369
qa: -0.0565 -0.0517 -0.2940 -0.3415 -0.3024 0.0929 0.0620 -0.0992 -0.2402 -0.2465 -0.2567 0.3238 0.0697 0.0263 0.0936 -0.1554 -0.1952 0.2019 -0.0843 -0.2063 0.2428 -0.1465 -0.1838 -0.1407 -0.1294 -0.1289 0.0773 0.0928 0.0910 0.0740 0.0928 0.0922 0.0961 0.0908 0.1231 0.1043 0.1117 0.0974 0.1049 0.1233 0.1258 0.1365 0.1248 0.1260 0.1319 0.1294
va: 1.2709 1.2549 2.0754 2.1623 2.1132 3.7873 3.7120 3.8864 3.9186 3.9121 3.8784 4.2282 4.2252 3.8650 3.6247 3.9211 4.0406 3.9003 3.9520 4.0354 3.7866 3.9043 3.9767 3.9142 3.8480 3.8532 1.0281 1.0268 1.0043 1.0093 1.0034 1.0037 1.0025 1.0137 1.0229 0.9896 1.0090 1.0222 1.0105 0.9993 1.0123 1.0040 1.0139 1.0005 1.0046 1.0045
dispcorr: -0.030190374 hartree
energy: -1958.449820965512
dipole: 6.54960 -6.97801 -0.42841 21.02804 -20.27597 0.75207 9.43960 -9.65228 -0.21267
magnitude: 0.89128 au
magnitude: 2.26545 debye
