program: Orca
programVersion: 5.0.2
elementType: Cl Cl O O O C C C C C C C C C C C C C C C C C C C C C H H H H H H H H H H H H H H H H H H H H
charge: 0
multiplicity: 1
keywords: wb97x-d3
keywords: def2-TZVPP
keywords: def2/J RIJCOSX
keywords: DEFGRID2
keywords: scfconv7
keywords: smallprint printgap noloewdin
keywords: NOSOSCF
formula: C21H20Cl2O3
InChI: InChI=1/C21H20Cl2O3/c1-21(2)17(12-18(22)23)19(21)20(24)25-13-14-7-6-10-16(11-14)26-15-8-4-3-5-9-15/h3-12,17,19H,13H2,1-2H3
46 atoms
Cl -4.818605 0.715831 -1.944172
Cl -3.103325 1.71425 -4.03367
O  0.763939 1.473602 1.347835
O  0.281438 2.689764 -0.467105
O  3.631229 -3.148784 0.466564
C  -2.493712 3.021113 0.936314
C  -2.649942 1.852646 0.007648
C  -1.471216 1.905164 0.972825
C  -3.434231 3.074161 2.117317
C  -2.152643 4.388265 0.39691
C  -2.484519 1.978914 -1.44689
C  -0.075758 2.081433 0.509725
C  -3.353429 1.527465 -2.342626
C  2.163891 1.500863 1.043369
C  2.553626 0.346194 0.165504
C  2.889889 -0.870568 0.747704
C  2.571654 0.476141 -1.219107
C  3.232999 -1.953069 -0.05184
C  2.920198 -0.608579 -2.008245
C  3.244953 -1.826693 -1.433542
C  3.010251 -3.673702 1.561463
C  3.806739 -4.360899 2.466992
C  1.636069 -3.591597 1.753504
C  3.223835 -4.971486 3.566157
C  1.068685 -4.199881 2.862623
C  1.854595 -4.891537 3.772504
H  -3.403093 1.132614 0.306532
H  -1.556277 1.231905 1.81776
H  -4.365853 3.571203 1.842362
H  -3.687133 2.079498 2.486188
H  -2.989502 3.631745 2.943409
H  -3.069028 4.893849 0.088763
H  -1.687722 4.995377 1.175475
H  -1.478573 4.373801 -0.453626
H  -1.602231 2.4711 -1.831173
H  2.438377 2.452566 0.587566
H  2.658745 1.430481 2.011619
H  2.892632 -0.970495 1.826969
H  2.30844 1.420237 -1.675658
H  2.934405 -0.508346 -3.085311
H  3.516993 -2.677228 -2.044714
H  4.874244 -4.418991 2.299504
H  1.011486 -3.064219 1.043923
H  3.847986 -5.509731 4.267072
H  -0.00162 -4.13745 3.008953
H  1.403577 -5.365291 4.63372
totalener: -1958.42578752 hartree
nucrepener: 2466.76898202 hartree
electener: -4425.19476955 hartree
oneelecener: -7586.72718399 hartree
twoeener: 3161.53241445 hartree
kineticenergy: 1952.60831386 hartree
xcener: -143.512546313276 hartree
chargesum: -0.0000000
charge: -0.053332 -0.047118 -0.261851 -0.418996 -0.299016 0.071142 0.051616 -0.106722 -0.233595 -0.250665 -0.229978 0.393817 0.039574 0.050181 -0.006638 -0.190399 -0.139969 0.220999 -0.099317 -0.197728 0.251505 -0.217722 -0.167397 -0.087293 -0.113224 -0.149458 0.075958 0.086887 0.092897 0.073092 0.089701 0.092289 0.088339 0.103113 0.132929 0.113143 0.103751 0.119750 0.131042 0.127444 0.126948 0.125260 0.133417 0.124884 0.126333 0.124407
qa: -0.0533 -0.0471 -0.2619 -0.4190 -0.2990 0.0711 0.0516 -0.1067 -0.2336 -0.2507 -0.2300 0.3938 0.0396 0.0502 -0.0066 -0.1904 -0.1400 0.2210 -0.0993 -0.1977 0.2515 -0.2177 -0.1674 -0.0873 -0.1132 -0.1495 0.0760 0.0869 0.0929 0.0731 0.0897 0.0923 0.0883 0.1031 0.1329 0.1131 0.1038 0.1198 0.1310 0.1274 0.1269 0.1253 0.1334 0.1249 0.1263 0.1244
va: 1.2750 1.2597 2.1467 2.0631 2.1080 3.7638 3.7887 3.9157 3.9129 3.9111 3.8884 4.1224 4.2437 3.8485 3.6982 3.9851 3.9552 3.8586 3.9579 4.0364 3.8103 4.0383 3.9385 3.9317 3.9458 3.9657 1.0337 1.0298 1.0042 1.0087 1.0043 1.0024 1.0021 1.0187 1.0372 1.0116 0.9991 1.0123 1.0212 0.9996 1.0119 1.0144 1.0044 0.9988 0.9999 1.0007
dispcorr: -0.021678567 hartree
energy: -1958.447466089819
dipole: 14.87014 -14.77326 0.09688 3.19335 -3.07447 0.11888 27.82494 -26.55138 1.27356
magnitude: 1.28276 au
magnitude: 3.26051 debye
