program: Orca
programVersion: 5.0.2
elementType: Cl Cl O O O C C C C C C C C C C C C C C C C C C C C C H H H H H H H H H H H H H H H H H H H H
charge: 0
multiplicity: 1
keywords: wb97x-d3
keywords: def2-TZVPP
keywords: def2/J RIJCOSX
keywords: DEFGRID2
keywords: scfconv7
keywords: smallprint printgap noloewdin
keywords: NOSOSCF
formula: C21H20Cl2O3
InChI: InChI=1/C21H20Cl2O3/c1-21(2)17(12-18(22)23)19(21)20(24)25-13-14-7-6-10-16(11-14)26-15-8-4-3-5-9-15/h3-12,17,19H,13H2,1-2H3
46 atoms
Cl -4.481243 -0.227972 0.001959
Cl -3.485313 -0.262132 -2.701622
O  1.162166 2.489477 0.891972
O  0.170842 2.701833 -1.09996
O  3.636461 -2.225187 1.532096
C  -2.301594 3.619861 0.554983
C  -2.454978 2.133591 0.422047
C  -1.13553 2.726436 0.913173
C  -3.002692 4.262361 1.729282
C  -2.274111 4.508188 -0.664373
C  -2.571727 1.46655 -0.880582
C  0.099468 2.641146 0.101098
C  -3.401172 0.464834 -1.145413
C  2.434325 2.289799 0.265874
C  2.634324 0.849464 -0.110327
C  3.016877 -0.063981 0.865297
C  2.412947 0.410028 -1.409923
C  3.193645 -1.400136 0.542277
C  2.588676 -0.929262 -1.723852
C  2.982645 -1.841206 -0.758877
C  3.156646 -3.497925 1.635757
C  1.817791 -3.809582 1.430376
C  4.057246 -4.481411 2.018913
C  1.391179 -5.116795 1.607243
C  3.613866 -5.781644 2.202724
C  2.281964 -6.107198 1.994158
H  -3.02145 1.659956 1.215296
H  -0.958617 2.599218 1.974608
H  -3.031387 3.607139 2.600667
H  -2.498846 5.184525 2.023691
H  -4.032584 4.512394 1.469583
H  -3.296402 4.749709 -0.959388
H  -1.767726 5.446597 -0.432526
H  -1.772481 4.072047 -1.521977
H  -1.941382 1.798215 -1.693444
H  2.544536 2.943113 -0.60054
H  3.161236 2.595292 1.017905
H  3.189689 0.258383 1.885295
H  2.097579 1.110655 -2.170532
H  2.422008 -1.270175 -2.736966
H  3.128515 -2.881923 -1.01781
H  1.111816 -3.041978 1.140657
H  5.095406 -4.220265 2.176605
H  0.348444 -5.357686 1.447798
H  4.318298 -6.544998 2.505658
H  1.940018 -7.123632 2.133834
totalener: -1958.42585328 hartree
nucrepener: 2478.89708730 hartree
electener: -4437.32294059 hartree
oneelecener: -7611.14012100 hartree
twoeener: 3173.81718041 hartree
kineticenergy: 1952.61988910 hartree
xcener: -143.514815419982 hartree
chargesum: -0.0000000
charge: -0.053128 -0.048031 -0.264230 -0.416177 -0.299579 0.069646 0.056114 -0.096589 -0.233336 -0.252062 -0.229463 0.390738 0.039040 0.056094 -0.008124 -0.227051 -0.120844 0.222535 -0.115991 -0.161031 0.247100 -0.165970 -0.213404 -0.116921 -0.089731 -0.146543 0.074150 0.085894 0.073861 0.089777 0.091944 0.091153 0.087630 0.102833 0.128140 0.110197 0.107604 0.110780 0.123621 0.128365 0.134016 0.134701 0.124156 0.128075 0.124763 0.125281
qa: -0.0531 -0.0480 -0.2642 -0.4162 -0.2996 0.0696 0.0561 -0.0966 -0.2333 -0.2521 -0.2295 0.3907 0.0390 0.0561 -0.0081 -0.2271 -0.1208 0.2225 -0.1160 -0.1610 0.2471 -0.1660 -0.2134 -0.1169 -0.0897 -0.1465 0.0741 0.0859 0.0739 0.0898 0.0919 0.0912 0.0876 0.1028 0.1281 0.1102 0.1076 0.1108 0.1236 0.1284 0.1340 0.1347 0.1242 0.1281 0.1248 0.1253
va: 1.2754 1.2586 2.1442 2.0673 2.1036 3.7639 3.7854 3.8979 3.9120 3.9090 3.9008 4.1256 4.2484 3.8440 3.6924 4.0910 3.9524 3.8683 3.9667 3.9497 3.8029 3.9388 4.0380 3.9509 3.9336 3.9619 1.0359 1.0303 1.0084 1.0042 1.0042 1.0019 1.0018 1.0201 1.0378 1.0111 0.9962 1.0245 1.0235 1.0007 1.0027 1.0036 1.0146 0.9998 0.9989 1.0005
dispcorr: -0.021687493 hartree
energy: -1958.447540775210
dipole: 16.26184 -16.02708 0.23476 12.30481 -11.89589 0.40892 11.34524 -10.75840 0.58684
magnitude: 0.75280 au
magnitude: 1.91347 debye
