program: Orca
programVersion: 5.0.2
elementType: Cl Cl O O O C C C C C C C C C C C C C C C C C C C C C H H H H H H H H H H H H H H H H H H H H
charge: 0
multiplicity: 1
keywords: wb97x-d3
keywords: def2-TZVPP
keywords: def2/J RIJCOSX
keywords: DEFGRID2
keywords: scfconv7
keywords: smallprint printgap noloewdin
keywords: NOSOSCF
formula: C21H20Cl2O3
InChI: InChI=1/C21H20Cl2O3/c1-21(2)17(12-18(22)23)19(21)20(24)25-13-14-7-6-10-16(11-14)26-15-8-4-3-5-9-15/h3-12,17,19H,13H2,1-2H3
46 atoms
Cl -4.70543 0.177342 -0.573476
Cl -3.512134 0.238876 -3.196386
O  1.010311 2.472511 0.939652
O  0.204532 2.810221 -1.118147
O  3.477171 -2.279461 1.612684
C  -2.328492 3.825776 0.383427
C  -2.574309 2.365459 0.143403
C  -1.264931 2.825501 0.778802
C  -3.0837 4.451199 1.533112
C  -2.12952 4.779197 -0.769134
C  -2.628923 1.785467 -1.204214
C  0.028214 2.705168 0.068928
C  -3.499489 0.862446 -1.593788
C  2.329287 2.269077 0.420191
C  2.544054 0.839132 0.013691
C  2.881431 -0.10197 0.979431
C  2.387059 0.437701 -1.307774
C  3.078665 -1.427939 0.626612
C  2.582697 -0.891343 -1.651452
C  2.933746 -1.830279 -0.695689
C  3.009984 -3.55993 1.654007
C  1.694892 -3.887091 1.345904
C  3.896574 -4.538306 2.080931
C  1.279084 -5.204628 1.460743
C  3.463089 -5.848963 2.202536
C  2.156273 -6.190515 1.888216
H  -3.239636 1.892446 0.856123
H  -1.189434 2.62495 1.840905
H  -3.227384 3.753826 2.359105
H  -2.549264 5.320032 1.920785
H  -4.070132 4.784041 1.20612
H  -1.578898 5.660283 -0.435343
H  -1.587531 4.357101 -1.609223
H  -3.101745 5.116384 -1.131947
H  -1.91647 2.1201 -1.944796
H  2.523972 2.947977 -0.41092
H  2.992509 2.537307 1.24203
H  3.004773 0.191261 2.01526
H  2.108589 1.159998 -2.062465
H  2.467506 -1.20275 -2.681085
H  3.098229 -2.861892 -0.978567
H  0.998356 -3.12389 1.023741
H  4.915822 -4.265183 2.320467
H  0.255086 -5.457364 1.219274
H  4.156581 -6.608333 2.538826
H  1.822907 -7.215375 1.978055
totalener: -1958.42592296 hartree
nucrepener: 2464.16825364 hartree
electener: -4422.59417660 hartree
oneelecener: -7581.66294755 hartree
twoeener: 3159.06877095 hartree
kineticenergy: 1952.62148097 hartree
xcener: -143.515322494137 hartree
chargesum: -0.0000000
charge: -0.053514 -0.048120 -0.263362 -0.418432 -0.299420 0.067469 0.057187 -0.098159 -0.233737 -0.252437 -0.227624 0.394002 0.039490 0.055571 -0.006589 -0.227882 -0.122956 0.227858 -0.115925 -0.166554 0.255771 -0.173357 -0.216408 -0.115110 -0.088141 -0.148115 0.074938 0.085644 0.073918 0.089207 0.092288 0.087948 0.102882 0.091279 0.127099 0.110511 0.106857 0.110530 0.125878 0.128589 0.134501 0.135071 0.123671 0.127531 0.124875 0.125277
qa: -0.0535 -0.0481 -0.2634 -0.4184 -0.2994 0.0675 0.0572 -0.0982 -0.2337 -0.2524 -0.2276 0.3940 0.0395 0.0556 -0.0066 -0.2279 -0.1230 0.2279 -0.1159 -0.1666 0.2558 -0.1734 -0.2164 -0.1151 -0.0881 -0.1481 0.0749 0.0856 0.0739 0.0892 0.0923 0.0879 0.1029 0.0913 0.1271 0.1105 0.1069 0.1105 0.1259 0.1286 0.1345 0.1351 0.1237 0.1275 0.1249 0.1253
va: 1.2751 1.2587 2.1451 2.0646 2.1058 3.7684 3.7834 3.8995 3.9128 3.9100 3.9035 4.1223 4.2497 3.8420 3.6938 4.0967 3.9523 3.8660 3.9662 3.9521 3.7968 3.9408 4.0400 3.9497 3.9326 3.9637 1.0361 1.0303 1.0086 1.0044 1.0040 1.0018 1.0200 1.0018 1.0379 1.0114 0.9967 1.0243 1.0235 1.0007 1.0024 1.0035 1.0149 0.9999 0.9989 1.0005
dispcorr: -0.021535777 hartree
energy: -1958.447458736527
dipole: 16.99355 -16.75915 0.23440 10.55149 -10.18550 0.36599 13.81501 -13.16705 0.64796
magnitude: 0.78022 au
magnitude: 1.98316 debye
