program: Orca
programVersion: 5.0.2
elementType: Cl Cl O O O C C C C C C C C C C C C C C C C C C C C C H H H H H H H H H H H H H H H H H H H H
charge: 0
multiplicity: 1
keywords: wb97x-d3
keywords: def2-TZVPP
keywords: def2/J RIJCOSX
keywords: DEFGRID2
keywords: scfconv7
keywords: smallprint printgap noloewdin
keywords: NOSOSCF
formula: C21H20Cl2O3
InChI: InChI=1/C21H20Cl2O3/c1-21(2)17(12-18(22)23)19(21)20(24)25-13-14-7-6-10-16(11-14)26-15-8-4-3-5-9-15/h3-12,17,19H,13H2,1-2H3
46 atoms
Cl -3.457126 -1.243593 -1.025554
Cl -1.506762 -1.093906 -3.143402
O  1.073175 2.374559 1.434131
O  0.568416 2.85886 -0.684986
O  2.197076 -2.364763 -0.119523
C  -2.395804 2.798264 0.170703
C  -2.068381 1.334872 0.073587
C  -1.167672 2.277435 0.871025
C  -3.54375 3.166722 1.082214
C  -2.312264 3.684023 -1.048413
C  -1.604765 0.71245 -1.173384
C  0.216595 2.548515 0.421511
C  -2.129082 -0.382913 -1.70722
C  2.457972 2.402542 1.101412
C  2.868599 1.227157 0.255522
C  2.312299 -0.026173 0.495841
C  3.817463 1.384869 -0.741442
C  2.703341 -1.112544 -0.274089
C  4.213964 0.287424 -1.493965
C  3.661939 -0.959311 -1.271385
C  1.246556 -2.582215 0.842912
C  -0.09178 -2.587773 0.48434
C  1.634439 -2.820552 2.153132
C  -1.052021 -2.840084 1.453449
C  0.666438 -3.067322 3.114224
C  -0.67739 -3.074899 2.768181
H  -2.665233 0.683768 0.701747
H  -1.252293 2.158538 1.944934
H  -3.43278 4.189229 1.447065
H  -4.493117 3.104236 0.54825
H  -3.608339 2.510026 1.950727
H  -3.262659 3.645783 -1.582979
H  -2.140338 4.719767 -0.75189
H  -1.525926 3.410047 -1.743096
H  -0.77248 1.156088 -1.70413
H  2.72056 3.339867 0.60566
H  2.96773 2.378859 2.065624
H  1.569375 -0.145787 1.273708
H  4.23462 2.362628 -0.94603
H  4.951178 0.409645 -2.276431
H  3.955741 -1.814588 -1.865291
H  -0.373994 -2.405574 -0.544396
H  2.685487 -2.814792 2.411927
H  -2.096767 -2.848122 1.174084
H  0.965315 -3.255029 4.137035
H  -1.429613 -3.271174 3.520348
totalener: -1958.42437893 hartree
nucrepener: 2686.21877216 hartree
electener: -4644.64315109 hartree
oneelecener: -8025.79799441 hartree
twoeener: 3381.15484332 hartree
kineticenergy: 1952.62195562 hartree
xcener: -143.517382439777 hartree
chargesum: -0.0000000
charge: -0.060702 -0.046468 -0.277132 -0.379516 -0.297004 0.085694 0.050574 -0.079126 -0.235954 -0.246668 -0.213697 0.328191 0.023444 0.070060 0.041655 -0.252564 -0.190481 0.299754 -0.071053 -0.228692 0.206965 -0.146792 -0.141804 -0.138718 -0.131993 -0.116191 0.073279 0.088561 0.091327 0.092140 0.073530 0.087376 0.088501 0.105240 0.136170 0.102374 0.106557 0.118212 0.101638 0.122202 0.122461 0.135741 0.125547 0.124878 0.126330 0.126154
qa: -0.0607 -0.0465 -0.2771 -0.3795 -0.2970 0.0857 0.0506 -0.0791 -0.2360 -0.2467 -0.2137 0.3282 0.0234 0.0701 0.0417 -0.2526 -0.1905 0.2998 -0.0711 -0.2287 0.2070 -0.1468 -0.1418 -0.1387 -0.1320 -0.1162 0.0733 0.0886 0.0913 0.0921 0.0735 0.0874 0.0885 0.1052 0.1362 0.1024 0.1066 0.1182 0.1016 0.1222 0.1225 0.1357 0.1255 0.1249 0.1263 0.1262
va: 1.2663 1.2577 2.1222 2.1041 2.1223 3.8036 3.8092 3.8839 3.9070 3.9105 3.8515 4.1789 4.2213 3.8580 3.7353 3.9192 4.0448 3.7817 3.9466 4.0542 3.8518 3.9722 3.9697 3.9381 3.9501 3.9642 1.0317 1.0295 1.0041 1.0049 1.0082 1.0021 1.0031 1.0206 1.0325 1.0095 0.9874 1.0340 1.0130 0.9990 1.0152 1.0110 1.0082 1.0150 0.9998 1.0003
dispcorr: -0.026910097 hartree
energy: -1958.451289025582
dipole: 4.41330 -4.60260 -0.18930 19.23349 -18.59431 0.63918 16.82488 -15.70496 1.11992
magnitude: 1.30331 au
magnitude: 3.31275 debye
