program: Orca
programVersion: 5.0.2
elementType: Cl Cl O O O C C C C C C C C C C C C C C C C C C C C C H H H H H H H H H H H H H H H H H H H H
charge: 0
multiplicity: 1
keywords: wb97x-d3
keywords: def2-TZVPP
keywords: def2/J RIJCOSX
keywords: DEFGRID2
keywords: scfconv7
keywords: smallprint printgap noloewdin
keywords: NOSOSCF
formula: C21H20Cl2O3
InChI: InChI=1/C21H20Cl2O3/c1-21(2)17(12-18(22)23)19(21)20(24)25-13-14-7-6-10-16(11-14)26-15-8-4-3-5-9-15/h3-12,17,19H,13H2,1-2H3
46 atoms
Cl -4.027654 -0.973847 0.741546
Cl -3.343522 -1.566993 -1.991844
O  1.430714 2.586098 0.158543
O  0.157299 2.086321 -1.618306
O  3.036635 -2.136304 0.946111
C  -2.182031 2.902584 0.31225
C  -2.046262 1.414909 0.452256
C  -0.815714 2.304091 0.567848
C  -2.794006 3.638842 1.480437
C  -2.535677 3.510512 -1.021979
C  -2.269303 0.501267 -0.6770
C  0.267398 2.302394 -0.440347
C  -3.100702 -0.531623 -0.638301
C  2.631294 2.534855 -0.596202
C  3.419679 1.284106 -0.309279
C  2.816293 0.146823 0.206505
C  4.780478 1.271139 -0.595394
C  3.5697 -1.00239 0.417153
C  5.524648 0.124541 -0.370353
C  4.927411 -1.019406 0.131894
C  1.711769 -2.416509 0.748763
C  1.164402 -2.455008 -0.527781
C  0.935983 -2.70861 1.859084
C  -0.172508 -2.781739 -0.683019
C  -0.399797 -3.044719 1.688474
C  -0.960048 -3.076984 0.421203
H  -2.361146 1.016421 1.409758
H  -0.448733 2.419778 1.580692
H  -2.540243 3.176755 2.435136
H  -2.449949 4.674064 1.510789
H  -3.881974 3.650218 1.397634
H  -2.096414 2.997102 -1.871557
H  -3.619287 3.500186 -1.148873
H  -2.208309 4.55073 -1.061251
H  -1.739448 0.670294 -1.604133
H  2.418444 2.60871 -1.664848
H  3.210517 3.413777 -0.308447
H  1.764169 0.143018 0.456614
H  5.261857 2.157871 -0.990042
H  6.583973 0.118647 -0.590288
H  5.501468 -1.91922 0.308047
H  1.776345 -2.228754 -1.391686
H  1.381025 -2.675999 2.844873
H  -0.603134 -2.804711 -1.674783
H  -1.005399 -3.275588 2.554853
H  -2.002791 -3.33183 0.291088
totalener: -1958.42487699 hartree
nucrepener: 2645.80304011 hartree
electener: -4604.22791711 hartree
oneelecener: -7944.80833998 hartree
twoeener: 3340.58042287 hartree
kineticenergy: 1952.61548209 hartree
xcener: -143.519612348620 hartree
chargesum: 0.0000000
charge: -0.056083 -0.053212 -0.269369 -0.391893 -0.298472 0.086083 0.045398 -0.116109 -0.231894 -0.253452 -0.206938 0.342596 0.038725 0.053363 0.048211 -0.164481 -0.209472 0.231098 -0.081237 -0.213920 0.228079 -0.157888 -0.192462 -0.129275 -0.109975 -0.108852 0.079277 0.092623 0.074207 0.090296 0.092389 0.102500 0.093491 0.088707 0.133019 0.114177 0.106398 0.122629 0.105791 0.123608 0.124224 0.131199 0.123581 0.126778 0.123832 0.122707
qa: -0.0561 -0.0532 -0.2694 -0.3919 -0.2985 0.0861 0.0454 -0.1161 -0.2319 -0.2535 -0.2069 0.3426 0.0387 0.0534 0.0482 -0.1645 -0.2095 0.2311 -0.0812 -0.2139 0.2281 -0.1579 -0.1925 -0.1293 -0.1100 -0.1089 0.0793 0.0926 0.0742 0.0903 0.0924 0.1025 0.0935 0.0887 0.1330 0.1142 0.1064 0.1226 0.1058 0.1236 0.1242 0.1312 0.1236 0.1268 0.1238 0.1227
va: 1.2714 1.2556 2.1346 2.0941 2.1109 3.7839 3.7957 3.9103 3.9066 3.9169 3.8657 4.1759 4.2368 3.8835 3.7104 3.9209 4.0211 3.8542 3.9566 4.0362 3.8170 3.9811 4.0338 3.9007 3.9719 3.8797 1.0324 1.0289 1.0086 1.0043 1.0045 1.0188 1.0020 1.0025 1.0362 1.0115 0.9896 1.0101 1.0108 0.9992 1.0139 1.0042 1.0127 1.0118 1.0019 1.0198
dispcorr: -0.026474336 hartree
energy: -1958.451351327357
dipole: 13.15553 -13.00964 0.14589 20.96489 -19.91716 1.04772 4.86179 -4.40207 0.45972
magnitude: 1.15341 au
magnitude: 2.93173 debye
