program: Gaussian 09
title: 000072004
version: EM64L-G09RevD.01
frameworkgroup: C1[X(C17H25NO7)]
method: RPBEPBE
basis: SDD
operation: Freq
keyword: #p
keyword: freq=noraman
keyword: PBEPBE/SDD
title: #p freq=noraman PBEPBE/SDD
converged: NO YES NO NO
title: Mulliken charges:
elementType: O O O O O O O N C C C C C C C C C C C C C C C C C H H H H H H H H H H H H H H H H H H H H H H H H H
charge: -0.444098 -0.430976 -0.458253 -0.442051 -0.261146 -0.291238 -0.265479 -0.102559 -0.155984 -0.077439 -0.100021 -0.128721 -0.497218 -0.402585 -0.396668 -0.303795 0.366688 -0.340624 -0.368559 -0.355569 -0.313604 0.219806 0.184221 -0.220442 -0.675111 0.230849 0.210438 0.223550 0.223862 0.247309 0.209355 0.224772 0.226352 0.221368 0.226754 0.352113 0.219113 0.220043 0.352067 0.345614 0.353373 0.252957 0.253447 0.268948 0.272058 0.228534 0.228306 0.211899 0.229350 0.228990
chargesum: 0.00000
title: Mulliken charges with hydrogens summed into heavy atoms:
elementType: O O O O O O O N C C C C C C C C C C C C C C C C C
charge: -0.091985 -0.078909 -0.112639 -0.088678 -0.261146 -0.291238 -0.265479 -0.102559 0.074866 0.132999 0.123528 0.095141 -0.040553 0.048540 0.051454 0.135361 0.366688 -0.087667 -0.115112 -0.086621 -0.041545 0.219806 0.184221 0.236398 -0.004872
polarizability: 3.34037177e+02 -9.28832568e-01 1.69172393e+02 -1.04386341e+00 1.28265415e+01 1.81005776e+02
1716.lowfreq: -16.1014 -11.3017 -3.8396 0.0003 0.0007 0.0020 1.9170 10.7887 24.8923
frequency: -12.5677 8.3335 24.8888 35.0288 37.9561 53.8202 72.8259 75.9778 89.7100 93.2230 94.2376 128.1011 139.8326 159.6734 173.2875 206.9800 219.5380 232.1867 245.8393 251.2726 270.5898 277.4203 292.2987 299.3594 307.6952 313.4258 327.2601 347.9504 359.5836 367.0648 397.3254 417.2259 420.1439 425.5610 446.7651 454.1573 502.5963 505.7308 514.1390 521.3502 568.4447 594.7907 627.5504 628.1787 635.2137 676.7891 753.4125 771.0761 797.4073 798.9301 807.5560 831.7631 848.5561 853.5628 856.2720 873.1622 882.9905 944.4193 960.4673 968.2861 977.5189 986.5747 987.5921 999.8658 1017.4927 1023.0498 1027.5720 1036.9454 1049.5716 1061.7651 1065.2600 1072.8546 1083.7008 1102.3316 1111.8213 1116.5536 1129.5851 1133.6882 1135.7973 1148.2891 1171.5743 1183.4783 1199.3668 1227.7465 1235.3354 1247.1937 1251.2085 1258.4092 1263.1199 1286.1876 1298.0801 1300.4947 1302.4756 1307.7436 1318.8642 1322.0853 1327.7353 1338.4874 1354.5190 1358.1600 1371.8094 1375.6276 1376.3982 1385.8636 1393.1907 1399.3972 1426.4073 1427.3149 1458.2238 1463.3019 1466.3050 1473.2853 1473.3490 1482.9328 1486.2076 1497.5069 1573.5716 1613.0793 1621.2058 2930.5731 2945.8208 2960.1514 2965.2781 2971.2014 2978.5274 2988.7148 2989.0378 2995.1916 3008.8228 3031.0478 3050.5748 3066.7029 3067.8321 3081.6222 3091.8786 3106.6315 3149.9980 3159.3411 3169.9041 3181.8747 3400.5239 3549.3953 3564.9788 3578.7024
redmass: 4.7511 3.9288 5.5782 5.0822 2.9638 5.7717 3.6637 6.1863 4.5882 4.7841 5.4026 2.7131 2.6083 3.0417 4.1855 4.1085 4.8702 4.4023 1.2912 2.6568 3.9217 4.0718 1.3254 1.7413 5.6627 2.0043 5.5895 3.6262 2.6123 6.0491 1.3788 2.9820 4.2266 2.8657 3.9204 3.5383 4.8552 2.9553 4.0488 2.8905 3.3080 5.2879 2.5037 2.0765 3.4408 4.1578 4.5114 6.6659 1.1039 1.2090 4.9949 1.2650 4.0377 1.6844 2.4604 2.1249 2.8494 6.9622 4.3822 8.1102 1.3579 1.3517 3.5201 3.1517 4.1527 2.2839 4.5468 2.1203 1.9426 1.9657 4.9886 2.4650 3.4799 2.3770 2.1773 1.3207 2.0086 1.5237 1.4684 1.4275 1.2444 1.2683 1.3589 3.2551 1.2754 1.1337 3.3385 1.2169 1.4502 1.1518 1.2594 1.2959 1.2713 1.2817 1.2505 1.4626 1.2572 1.3563 1.3046 1.4267 1.3293 1.9824 1.4389 1.8812 1.4861 1.2717 1.6248 4.2129 1.0891 1.0406 1.0903 1.0602 1.1084 1.1032 1.0772 2.3414 7.9419 9.4581 7.0440 1.0806 1.0845 1.0816 1.0611 1.0660 1.0802 1.0617 1.0627 1.0357 1.0581 1.1040 1.1047 1.1065 1.1006 1.1010 1.0985 1.1025 1.0880 1.0886 1.0960 1.0970 1.0662 1.0652 1.0661 1.0666
irintensity: 1.6396 0.0657 2.0996 0.9432 0.0568 2.5474 2.6675 1.8407 1.4666 0.3286 1.6630 4.7643 1.4041 7.2629 4.8118 3.4369 6.6301 13.1778 1.3420 9.6917 6.1463 34.9551 149.5190 13.2692 2.8944 110.7160 16.3402 29.4507 33.2441 18.6176 117.1631 0.0543 19.1576 35.0955 12.0755 12.9198 12.9301 9.6346 5.6752 17.0455 20.5622 52.0494 37.4789 44.2642 21.6877 25.7443 16.9995 9.0461 0.6622 12.5582 6.3566 0.6790 9.5588 55.0502 12.8115 17.8930 14.3070 44.7130 137.7711 178.6257 1.1723 0.0906 13.7048 31.8146 209.1587 27.7102 41.0071 22.9513 8.4841 80.6798 367.1079 6.1614 4.0157 0.1902 4.3720 12.3841 76.0312 12.0908 5.5554 9.2476 261.7728 21.5029 10.3901 186.0725 16.4968 0.0017 527.2306 16.4746 6.6060 26.7349 11.2024 3.5473 16.5159 2.5638 0.4224 35.2961 1.3954 1.6003 13.6880 9.6919 32.2005 9.5613 2.7966 16.4505 1.9329 20.0792 25.8152 2.5063 23.3527 12.0651 17.3280 4.6122 26.8705 21.9470 16.3260 62.1897 3.1068 364.3522 132.4433 1.4251 44.4744 7.8432 17.5442 7.6573 109.8807 53.8797 56.8510 23.0647 23.9615 17.0030 40.6978 8.2652 38.4212 24.9442 33.8375 46.1154 3.4314 2.7114 13.0279 3.3536 109.8476 12.2532 16.3958 9.3199
temp: 298.150 k
press: 1.00000 atm
elementType: 8 8 8 8 8 8 8 7 6 6 6 6 6 6 6 6 6 6 6 6 6 6 6 6 6 1 1 1 1 1 1 1 1 1 1 1 1 1 1 1 1 1 1 1 1 1 1 1 1 1
symmnumber: 1
zpe: 1066821.2 jmol-1
zpe.correction: 0.406331 hartree
zpe.thermalcorrener: 0.431855 hartree
zpe.thermalcorrenthalpy: 0.432799 hartree
zpe.thermalcorrgfe: 0.348391 hartree
zpe.sumelectzpe: -1242.137426 hartree
zpe.sumelectthermal: -1242.111902 hartree
zpe.sumelectthermalent: -1242.110958 hartree
zpe.sumelectthermalfe: -1242.195365 hartree
dipole: -2.5341 -1.3654 1.6030
dipole: 3.2948
quadrupole: -182.0972 -138.6821 -152.4302
quadrupole: 2.7310 31.5769 4.0184
quadrupole: -24.3607 19.0544 5.3063 2.7310 31.5769 4.0184
hfenergy: -1242.5437568 hartree
pointgroup: C01 [X(C17H25N1O7)]
dipole: -1.0226746 0.7442583 -0.2837806 debye
polarizability: 333.6940511|6.9282274|161.2779508|3.3302127|1.1507736|189.2433449 unknown
InChI: InChI=1S/C17H25NO7/c1-2-24-17(23)11-3-5-12(6-4-11)25-8-7-18-9-14(20)16(22)15(21)13(18)10-19/h3-6,13-16,19-22H,2,7-10H2,1H3
charge 0 multiplicity 1
50 atoms
O  6.44167 -1.410959 -0.026432
O  6.460781 0.792229 1.890198
O  5.200354 3.114935 0.788931
O  4.744454 -3.010615 -1.540062
O  -0.410663 -0.198058 0.61774
O  -6.783491 -0.430288 0.326868
O  -6.399463 -0.007453 -1.934833
N  3.076191 0.2847 -0.614818
C  4.195079 -0.673605 -0.808273
C  5.251526 -0.64744 0.350359
C  5.718407 0.790168 0.627707
C  4.548839 1.788877 0.722744
C  3.590705 1.66803 -0.487921
C  1.981638 -0.057927 0.32707
C  3.667335 -2.101932 -1.088281
C  0.630919 0.02151 -0.40271
C  -1.748807 -0.183871 0.211219
C  -2.175134 0.036016 -1.125067
C  -2.700998 -0.408416 1.239921
C  -3.552203 0.027026 -1.4176
C  -4.07066 -0.414439 0.935641
C  -4.512042 -0.196681 -0.399198
C  -5.949787 -0.19478 -0.774204
C  -8.247904 -0.448087 0.038551
C  -8.953796 -0.723183 1.362579
H  4.734421 -0.341911 -1.724517
H  4.793084 -1.06023 1.27842
H  6.372771 1.107777 -0.214258
H  3.997843 1.592204 1.667709
H  4.137192 1.945156 -1.410308
H  2.7401 2.36791 -0.384084
H  1.94879 0.628944 1.197554
H  2.106566 -1.072033 0.744075
H  2.852154 -2.054531 -1.837579
H  3.289805 -2.590437 -0.174675
H  6.128557 -2.288604 -0.388379
H  0.56664 -0.753616 -1.19162
H  0.503472 1.018251 -0.871365
H  6.782561 1.720461 2.029955
H  4.549901 3.79263 1.100085
H  5.036174 -2.746948 -2.449567
H  -1.454071 0.211027 -1.928375
H  -2.341387 -0.57491 2.259657
H  -3.90716 0.192802 -2.440213
H  -4.81204 -0.586893 1.720364
H  -8.444709 -1.229811 -0.717546
H  -8.529382 0.527428 -0.397981
H  -10.047517 -0.749186 1.204909
H  -8.640358 -1.694579 1.781863
H  -8.728356 0.065043 2.101249
