program: Gaussian 09
title: 000072000
version: EM64L-G09RevD.01
frameworkgroup: C1[X(C21H21N3O6S)]
method: RPBEPBE
basis: SDD
operation: Freq
keyword: #p
keyword: freq=noraman
keyword: PBEPBE/SDD
title: #p freq=noraman PBEPBE/SDD
converged: YES YES NO NO
title: Mulliken charges:
elementType: S O O O O O O N N N C C C C C C C C C C C C C C C C C C C C C H H H H H H H H H H H H H H H H H H H H H
charge: 0.173141 -0.166713 -0.413754 -0.200272 -0.232426 -0.433161 -0.239377 -0.081987 -0.356872 -0.023848 -0.471734 -0.118997 -0.177565 -0.148083 0.104914 -0.675553 -0.672306 0.176728 0.259559 -0.454676 0.523151 -0.431315 -0.307016 -0.296086 -0.385251 -0.356615 0.283861 0.310461 -0.354425 -0.252402 -0.159902 0.332786 0.303098 0.312510 0.222364 0.234666 0.258459 0.233941 0.230562 0.252048 0.312808 0.162944 0.387123 0.224504 0.272409 0.216588 0.217180 0.249404 0.282932 0.351689 0.257650 0.262857
chargesum: 0.00000
title: Mulliken charges with hydrogens summed into heavy atoms:
elementType: S O O O O O O N N N C C C C C C C C C C C C C C C C C C C C C
charge: 0.173141 -0.166713 -0.026630 -0.200272 -0.232426 -0.081472 -0.239377 -0.081987 -0.044065 -0.023848 -0.138949 -0.118997 0.125533 0.164427 0.104914 0.039936 0.044244 0.176728 0.259559 -0.291732 0.523151 -0.206811 -0.034607 -0.079497 -0.168071 -0.107211 0.283861 0.310461 -0.071493 0.005248 0.102955
polarizability: 3.26530478e+02 2.57393336e+01 3.36104055e+02 2.37509615e+01 -9.71851693e+00 2.37387268e+02
1716.lowfreq: -7.0355 -2.1586 -0.0014 -0.0012 -0.0011 3.4701 9.5248 15.8484 23.3708
frequency: 6.2173 15.6037 22.8189 25.6860 34.0171 39.1840 44.8808 57.4346 59.8374 67.2652 79.4260 100.3350 108.7799 119.3921 138.5095 141.4437 166.6080 194.5832 202.9889 225.2785 245.4712 247.8988 265.5152 277.5356 287.5597 299.9918 307.0423 318.7799 333.2561 341.9580 354.7661 360.3738 372.1555 382.4555 401.3812 410.4016 426.5817 467.3027 474.5789 489.3994 510.5194 528.9759 557.8598 573.2106 583.7438 588.1826 616.5840 617.3421 630.4007 634.7558 642.1565 682.2014 689.2352 712.0655 732.8683 737.2514 739.3367 753.2731 770.7997 794.9949 801.8482 827.8322 832.1676 838.7057 861.1905 862.8418 870.2382 894.3109 897.7422 904.9734 915.1245 924.7214 937.2144 944.9137 955.0827 958.2010 967.0034 978.2634 985.7297 1004.8809 1010.6987 1011.3059 1035.8746 1053.2029 1071.2233 1104.3862 1115.3745 1127.6279 1136.0211 1142.8435 1166.5905 1171.2543 1177.1088 1179.2374 1189.3059 1197.2379 1200.9958 1217.4351 1231.8804 1237.2973 1244.2210 1246.9932 1265.5710 1276.6769 1280.4501 1298.1996 1314.4075 1337.1131 1355.5280 1360.6715 1379.1029 1387.4315 1399.5716 1405.4255 1429.7507 1458.1111 1466.5567 1467.0067 1473.7353 1476.8975 1487.4533 1502.7731 1569.9881 1597.6170 1611.8209 1625.3461 1636.0708 1668.8703 1728.1667 2877.2187 2949.6171 2979.0844 2988.1771 3048.6512 3067.8855 3075.0372 3084.6462 3098.3177 3102.3485 3109.1737 3126.0017 3133.0501 3162.7283 3187.1456 3224.8695 3244.9300 3268.0041 3506.8295 3507.7828 3581.3550
redmass: 7.4005 6.2689 6.0269 6.3175 4.3485 4.7303 7.7419 5.7372 10.0237 6.8471 7.9852 7.0181 7.5543 4.9720 6.4222 5.8451 6.5505 5.9284 4.7717 6.6391 3.3000 2.4816 1.5836 5.1960 2.5715 1.6558 2.9395 3.9724 4.4402 3.9287 1.1276 5.4004 6.7449 3.7710 4.0436 2.9364 6.1198 6.1365 6.3265 4.4190 3.1287 4.1406 3.6067 4.5271 3.2504 3.0951 1.7198 1.5592 6.5919 3.4241 4.4027 3.8860 3.6503 6.0953 4.5990 1.5769 3.3528 5.1938 6.9693 1.6665 3.4710 2.1550 1.3236 2.7013 4.2608 4.3686 6.4882 1.5009 3.4453 3.4465 1.8847 2.1523 2.3585 1.5156 2.2882 1.7247 4.5419 1.9889 3.3932 2.7401 1.5087 1.5478 2.6214 3.0952 2.5634 1.4451 1.7761 2.5913 1.5890 1.3684 1.5950 2.5963 2.1786 1.1405 1.6464 2.2958 2.0553 1.7432 1.6420 1.6814 1.5878 2.8975 1.6884 1.9290 1.4588 1.5595 1.7830 1.4327 2.1365 1.9375 1.9973 1.1927 5.8917 1.1903 2.6156 1.0494 1.1916 3.0964 1.6017 1.1340 1.0472 2.7312 6.4389 6.5581 7.5000 6.5129 7.2408 8.9878 12.7523 1.0822 1.0855 1.0375 1.0365 1.0839 1.0862 1.0964 1.0986 1.1006 1.1003 1.0870 1.0910 1.0967 1.0893 1.0966 1.0915 1.0994 1.1083 1.0642 1.0774 1.0660
irintensity: 0.6296 0.7966 0.3082 0.6693 0.3924 0.3576 0.2082 0.4730 1.3306 1.1764 3.4696 5.5259 4.7093 2.6359 1.2980 2.2178 0.8428 9.2661 1.6056 0.9768 2.2065 4.1412 0.0371 0.2635 6.9019 11.9817 3.6321 28.5011 4.7197 0.2461 139.2193 11.9426 0.3146 1.1549 14.1724 1.6337 3.6504 2.3334 1.6357 51.7740 22.1565 10.9623 64.5285 1.9796 46.9870 8.5523 15.7310 99.9808 8.3405 23.4625 1.2316 63.3019 5.6356 24.7781 1.6360 97.3176 17.0310 10.7911 11.7175 25.8625 12.7588 7.2920 31.7154 17.7829 7.8463 25.3276 5.2686 0.0605 18.2848 3.9488 8.6504 6.4131 13.0592 3.3900 3.0732 6.4033 16.0271 5.3481 9.9184 7.6634 19.7216 21.3825 90.9679 29.9143 270.9386 54.0352 118.8310 0.8147 3.1808 253.6752 24.3010 7.1772 21.6519 13.2098 14.3104 17.1261 12.7316 51.6487 12.6480 8.2384 2.2846 36.5307 99.8250 150.7318 26.6541 10.6611 41.2974 33.6683 15.0348 30.6391 12.4399 20.8924 23.6138 14.9117 18.7195 6.3064 24.1581 35.2380 367.3210 98.2354 13.9649 58.3136 1.0152 10.7516 151.5234 72.7618 155.2248 174.7877 339.2085 74.9346 41.3749 16.2987 22.1780 34.3746 0.5921 15.5275 17.3371 7.4729 20.5077 19.9261 3.1027 18.6033 6.8052 1.2592 4.2171 0.4291 0.0814 40.8594 40.3161 44.8078
temp: 298.150 k
press: 1.00000 atm
elementType: 16 8 8 8 8 8 8 7 7 7 6 6 6 6 6 6 6 6 6 6 6 6 6 6 6 6 6 6 6 6 6 1 1 1 1 1 1 1 1 1 1 1 1 1 1 1 1 1 1 1 1 1
symmnumber: 1
zpe: 1022955.0 jmol-1
zpe.correction: 0.389623 hartree
zpe.thermalcorrener: 0.419355 hartree
zpe.thermalcorrenthalpy: 0.420299 hartree
zpe.thermalcorrgfe: 0.323624 hartree
zpe.sumelectzpe: -1824.196829 hartree
zpe.sumelectthermal: -1824.167097 hartree
zpe.sumelectthermalent: -1824.166153 hartree
zpe.sumelectthermalfe: -1824.262828 hartree
dipole: 3.9829 4.0490 5.1082
dipole: 7.6388
quadrupole: -159.6570 -183.3546 -180.6130
quadrupole: -2.1163 -4.6738 -10.6427
quadrupole: 14.8846 -8.8131 -6.0715 -2.1163 -4.6738 -10.6427
hfenergy: -1824.5864523 hartree
pointgroup: C01 [X(C21H21N3O6S1)]
dipole: 0.8197159 -0.6240277 -2.8232352 debye
polarizability: 310.4027117|2.2748081|315.5582605|-25.8298305|55.6867985|274.0608282 unknown
InChI: InChI=1S/C21H21N3O6S/c1-21(2)16(20(28)29)24-18(27)15(19(24)31-21)23-17(26)14(11-5-7-12(25)8-6-11)22-10-13-4-3-9-30-13/h3-10,14-16,19,23,25,28H,1-2H3
charge 0 multiplicity 1
52 atoms
S  2.181887 -1.526966 -1.466407
O  3.691128 1.732966 1.037686
O  6.886165 -2.018423 -0.786838
O  5.140523 -3.189988 0.208825
O  -0.503296 0.557318 2.58482
O  -4.313064 5.638469 3.187366
O  -3.94337 -1.569325 -2.613579
N  3.81972 -0.638897 0.484422
N  0.67162 0.444764 0.577612
N  -2.5823 0.169457 0.294255
C  2.527409 -1.358781 0.409596
C  3.976349 -0.910291 -1.958249
C  4.789114 -0.863922 -0.584318
C  1.849311 -0.146446 1.157158
C  3.234598 0.583689 0.937957
C  3.869835 0.517678 -2.535931
C  4.547215 -1.897048 -2.994423
C  5.573764 -2.148496 -0.322831
C  -0.4542 0.745956 1.340426
C  -1.640939 1.303528 0.498113
C  -2.341997 2.458699 1.201734
C  -2.291343 3.759187 0.650741
C  -3.057714 2.247596 2.409503
C  -2.835353 -0.191521 -0.939303
C  -2.934493 4.842908 1.289233
C  -3.705011 3.317286 3.053561
C  -3.64224 4.614898 2.492924
C  -3.747408 -1.279472 -1.237257
C  -4.517561 -2.153938 -0.472231
C  -5.218444 -3.01855 -1.387296
C  -4.847643 -2.637072 -2.670514
H  2.493089 -2.353989 0.868227
H  5.495618 -0.017682 -0.621733
H  1.637495 -0.345302 2.22259
H  4.856564 0.847414 -2.915338
H  3.153894 0.542457 -3.375319
H  3.534224 1.244345 -1.77627
H  3.944729 -1.867224 -3.918789
H  5.585208 -1.617537 -3.254429
H  4.538234 -2.934039 -2.618809
H  0.653054 0.560261 -0.439743
H  -1.227445 1.681812 -0.469449
H  7.385142 -2.86663 -0.631391
H  -1.743935 3.93687 -0.283252
H  -3.091864 1.242901 2.837608
H  -2.387648 0.303689 -1.828324
H  -2.885135 5.848958 0.852562
H  -4.258631 3.171872 3.985709
H  -4.559698 -2.156283 0.614408
H  -4.203224 6.506497 2.725503
H  -5.908507 -3.819852 -1.131081
H  -5.106128 -2.984199 -3.667036
