program: Orca
programVersion: 5.0.2
elementType: Cl Cl O O O C C C C C C C C C C C C C C C C C C C C C H H H H H H H H H H H H H H H H H H H H
charge: 0
multiplicity: 1
keywords: wb97x-d3
keywords: def2-TZVPP
keywords: def2/J RIJCOSX
keywords: DEFGRID2
keywords: scfconv7
keywords: smallprint printgap noloewdin
keywords: NOSOSCF
formula: C21H20Cl2O3
InChI: InChI=1/C21H20Cl2O3/c1-21(2)17(12-18(22)23)19(21)20(24)25-13-14-7-6-10-16(11-14)26-15-8-4-3-5-9-15/h3-12,17,19H,13H2,1-2H3
46 atoms
Cl -4.155269 -0.869014 1.047855
Cl -3.432861 -1.710005 -1.612124
O  1.39327 2.616417 0.132364
O  0.057466 1.9358 -1.532901
O  2.979839 -2.30088 0.16215
C  -2.210438 2.843498 0.445648
C  -2.035684 1.367707 0.650926
C  -0.821642 2.285045 0.672779
C  -2.793868 3.621608 1.600875
C  -2.632299 3.372453 -0.901949
C  -2.285445 0.395689 -0.424511
C  0.216634 2.249851 -0.380652
C  -3.175096 -0.583714 -0.340484
C  2.565546 2.521525 -0.678313
C  3.372265 1.316815 -0.282981
C  2.777513 0.059477 -0.270634
C  4.706812 1.449105 0.072457
C  3.509678 -1.048844 0.127453
C  5.442937 0.328003 0.431659
C  4.850213 -0.920624 0.474169
C  1.640486 -2.458172 0.399098
C  0.911228 -3.240542 -0.481571
C  1.032152 -1.89308 1.513648
C  -0.436521 -3.465175 -0.240748
C  -0.316768 -2.117826 1.736897
C  -1.055681 -2.904634 0.864782
H  -2.306791 1.01099 1.63836
H  -0.414068 2.460479 1.661156
H  -3.884211 3.590652 1.569621
H  -2.479509 3.221235 2.565511
H  -2.487201 4.668163 1.559802
H  -2.340415 4.418844 -1.005259
H  -2.208255 2.828147 -1.740247
H  -3.71885 3.322332 -0.987424
H  -1.725529 0.471722 -1.346071
H  2.298606 2.488692 -1.735642
H  3.134293 3.434491 -0.499751
H  1.747293 -0.063038 -0.580167
H  5.17436 2.425834 0.074832
H  6.484552 0.432572 0.70475
H  5.411094 -1.79551 0.774925
H  1.400669 -3.669468 -1.346005
H  1.608052 -1.285305 2.199987
H  -1.007565 -4.072093 -0.930232
H  -0.793571 -1.677713 2.603066
H  -2.10736 -3.077706 1.046112
totalener: -1958.42453633 hartree
nucrepener: 2660.13204713 hartree
electener: -4618.55658346 hartree
oneelecener: -7973.52034811 hartree
twoeener: 3354.96376465 hartree
kineticenergy: 1952.62191466 hartree
xcener: -143.519299738353 hartree
chargesum: 0.0000000
charge: -0.060511 -0.048694 -0.261904 -0.405564 -0.299180 0.094085 0.003260 -0.085636 -0.233728 -0.254166 -0.206474 0.343652 0.050117 0.063046 0.001242 -0.153387 -0.197654 0.225158 -0.073488 -0.217252 0.236830 -0.189882 -0.162721 -0.097471 -0.128452 -0.129638 0.077729 0.090549 0.092842 0.072627 0.090411 0.089222 0.103669 0.092744 0.138042 0.119350 0.092935 0.141596 0.106576 0.123967 0.125898 0.123432 0.128611 0.124890 0.121407 0.131912
qa: -0.0605 -0.0487 -0.2619 -0.4056 -0.2992 0.0941 0.0033 -0.0856 -0.2337 -0.2542 -0.2065 0.3437 0.0501 0.0630 0.0012 -0.1534 -0.1977 0.2252 -0.0735 -0.2173 0.2368 -0.1899 -0.1627 -0.0975 -0.1285 -0.1296 0.0777 0.0905 0.0928 0.0726 0.0904 0.0892 0.1037 0.0927 0.1380 0.1193 0.0929 0.1416 0.1066 0.1240 0.1259 0.1234 0.1286 0.1249 0.1214 0.1319
va: 1.2694 1.2606 2.1424 2.0670 2.1098 3.7926 3.8173 3.9284 3.9067 3.9184 3.8409 4.1648 4.2659 3.8541 3.8192 3.8857 4.0125 3.8503 3.9506 4.0434 3.8111 4.0596 3.9515 3.9390 3.8955 3.8916 1.0283 1.0302 1.0044 1.0086 1.0046 1.0024 1.0175 1.0024 1.0348 1.0137 0.9998 1.0157 1.0132 0.9992 1.0132 1.0130 1.0047 1.0066 1.0056 1.0136
dispcorr: -0.027345096 hartree
energy: -1958.451881431125
dipole: 13.45212 -13.18778 0.26433 21.36106 -20.31837 1.04269 5.49452 -4.86320 0.63132
magnitude: 1.24725 au
magnitude: 3.17026 debye
