program: Orca
programVersion: 5.0.2
elementType: Cl Cl O O O C C C C C C C C C C C C C C C C C C C C C H H H H H H H H H H H H H H H H H H H H
charge: 0
multiplicity: 1
keywords: wb97x-d3
keywords: def2-TZVPP
keywords: def2/J RIJCOSX
keywords: DEFGRID2
keywords: scfconv7
keywords: smallprint printgap noloewdin
keywords: NOSOSCF
formula: C21H20Cl2O3
InChI: InChI=1/C21H20Cl2O3/c1-21(2)17(12-18(22)23)19(21)20(24)25-13-14-7-6-10-16(11-14)26-15-8-4-3-5-9-15/h3-12,17,19H,13H2,1-2H3
46 atoms
Cl -0.728251 0.217546 1.97248
Cl -2.739707 -1.58216 0.938743
O  0.831457 2.708298 -0.687297
O  -0.798322 1.360417 -1.433691
O  1.961569 -2.458999 0.764293
C  -2.700252 3.511736 -0.22133
C  -2.487366 2.480996 0.835348
C  -1.28672 3.100079 0.137033
C  -3.101313 4.894961 0.233981
C  -3.311532 3.122722 -1.544627
C  -2.881223 1.070204 0.636945
C  -0.432563 2.280184 -0.750508
C  -2.207267 0.039704 1.124803
C  1.835584 1.966623 -1.38594
C  2.471303 0.955778 -0.474908
C  1.910045 -0.308851 -0.334229
C  3.596522 1.299151 0.265489
C  2.481501 -1.222084 0.542555
C  4.155582 0.382873 1.142454
C  3.606344 -0.879947 1.282052
C  1.306457 -3.12315 -0.233254
C  0.098612 -3.724058 0.083456
C  1.848974 -3.253021 -1.506023
C  -0.567801 -4.465988 -0.879835
C  1.166684 -3.9874 -2.462478
C  -0.041137 -4.597907 -2.155585
H  -2.597888 2.82118 1.862119
H  -0.731878 3.816001 0.731337
H  -2.780453 5.650167 -0.485117
H  -4.185936 4.96759 0.331588
H  -2.664892 5.150107 1.200406
H  -4.399834 3.178406 -1.475347
H  -2.999801 3.817985 -2.325467
H  -3.042363 2.122158 -1.871254
H  -3.794091 0.857583 0.094237
H  1.417812 1.494753 -2.275694
H  2.569421 2.707325 -1.703461
H  1.022474 -0.56848 -0.897315
H  4.03449 2.283755 0.158788
H  5.032913 0.648882 1.717006
H  4.038292 -1.603934 1.960284
H  -0.310176 -3.606168 1.0777
H  2.795999 -2.787388 -1.747199
H  -1.509827 -4.936177 -0.630406
H  1.588018 -4.087346 -3.454041
H  -0.566431 -5.17309 -2.905851
totalener: -1958.42142255 hartree
nucrepener: 2696.44699691 hartree
electener: -4654.86841945 hartree
oneelecener: -8047.01587106 hartree
twoeener: 3392.14745160 hartree
kineticenergy: 1952.63789453 hartree
xcener: -143.518869557945 hartree
chargesum: 0.0000000
charge: -0.039934 -0.053944 -0.259220 -0.388841 -0.294327 0.103274 -0.045276 -0.089385 -0.236723 -0.280371 -0.173401 0.340639 0.093212 0.046174 0.028511 -0.224552 -0.197051 0.265962 -0.080296 -0.226673 0.270618 -0.229248 -0.167343 -0.081410 -0.110141 -0.143023 0.102238 0.083056 0.091717 0.087986 0.073867 0.088946 0.087935 0.111189 0.110224 0.113815 0.099105 0.148494 0.105092 0.123598 0.124809 0.124086 0.127755 0.121987 0.124110 0.122763
qa: -0.0399 -0.0539 -0.2592 -0.3888 -0.2943 0.1033 -0.0453 -0.0894 -0.2367 -0.2804 -0.1734 0.3406 0.0932 0.0462 0.0285 -0.2246 -0.1971 0.2660 -0.0803 -0.2267 0.2706 -0.2292 -0.1673 -0.0814 -0.1101 -0.1430 0.1022 0.0831 0.0917 0.0880 0.0739 0.0889 0.0879 0.1112 0.1102 0.1138 0.0991 0.1485 0.1051 0.1236 0.1248 0.1241 0.1278 0.1220 0.1241 0.1228
va: 1.2966 1.2562 2.1331 2.0826 2.1037 3.7240 3.8951 3.8562 3.9059 3.9067 3.9027 4.1522 4.1894 3.8627 3.6895 3.8513 4.0436 3.7639 3.9367 4.0606 3.7890 4.0238 3.9614 3.9312 3.9437 3.9747 1.0075 1.0356 1.0044 1.0047 1.0077 0.9979 1.0046 1.0158 1.0161 1.0153 0.9967 1.0197 1.0118 0.9989 1.0136 1.0255 1.0061 1.0005 1.0001 1.0006
dispcorr: -0.026977062 hartree
energy: -1958.448399610160
dipole: -0.61900 0.47140 -0.14760 18.03579 -16.95295 1.08284 -14.02069 13.80263 -0.21806
magnitude: 1.11439 au
magnitude: 2.83256 debye
