program: Orca
programVersion: 5.0.2
elementType: Cl Cl O O O C C C C C C C C C C C C C C C C C C C C C H H H H H H H H H H H H H H H H H H H H
charge: 0
multiplicity: 1
keywords: wb97x-d3
keywords: def2-TZVPP
keywords: def2/J RIJCOSX
keywords: DEFGRID2
keywords: scfconv7
keywords: smallprint printgap noloewdin
keywords: NOSOSCF
formula: C21H20Cl2O3
InChI: InChI=1/C21H20Cl2O3/c1-21(2)17(12-18(22)23)19(21)20(24)25-13-14-7-6-10-16(11-14)26-15-8-4-3-5-9-15/h3-12,17,19H,13H2,1-2H3
46 atoms
Cl -0.096786 0.963065 2.222261
Cl -1.985833 -1.210032 2.004143
O  0.822628 2.711421 -0.971954
O  -0.790137 1.190858 -1.280392
O  1.811111 -2.630316 0.600426
C  -2.737531 3.403079 -0.325272
C  -2.28111 2.70298 0.910489
C  -1.253617 3.21507 -0.08903
C  -3.238776 4.820246 -0.168051
C  -3.459826 2.64181 -1.409802
C  -2.517644 1.259092 1.124037
C  -0.424481 2.249347 -0.843417
C  -1.64775 0.449212 1.709872
C  1.79511 1.817545 -1.520634
C  2.27388 0.846187 -0.479501
C  1.818744 -0.466263 -0.481605
C  3.136567 1.280679 0.519568
C  2.236612 -1.342486 0.511916
C  3.541448 0.400613 1.510703
C  3.100341 -0.911052 1.510436
C  1.267341 -3.250318 -0.48998
C  -0.043962 -3.689872 -0.411056
C  2.027152 -3.486956 -1.628087
C  -0.595563 -4.384703 -1.477462
C  1.461835 -4.173325 -2.690874
C  0.151655 -4.625982 -2.619934
H  -2.306487 3.287805 1.826735
H  -0.714106 4.100573 0.2251
H  -2.716675 5.355758 0.62596
H  -3.104943 5.384358 -1.09241
H  -4.302951 4.826465 0.074162
H  -4.531256 2.635226 -1.199336
H  -3.321054 3.134032 -2.373598
H  -3.126922 1.613874 -1.517219
H  -3.465704 0.836903 0.814168
H  1.398004 1.300722 -2.395596
H  2.60925 2.464245 -1.847221
H  1.117254 -0.785989 -1.240797
H  3.489778 2.304358 0.524778
H  4.21411 0.734596 2.289692
H  3.412867 -1.603801 2.280611
H  -0.621515 -3.485554 0.480142
H  3.052165 -3.141998 -1.677484
H  -1.618592 -4.731319 -1.414783
H  2.0527 -4.360752 -3.577749
H  -0.282861 -5.165151 -3.450865
totalener: -1958.42114717 hartree
nucrepener: 2715.13587906 hartree
electener: -4673.55702623 hartree
oneelecener: -8084.53707155 hartree
twoeener: 3410.98004532 hartree
kineticenergy: 1952.64523454 hartree
xcener: -143.520679390579 hartree
chargesum: 0.0000000
charge: -0.039520 -0.059351 -0.258677 -0.386095 -0.290302 0.104958 -0.047706 -0.084746 -0.237787 -0.278948 -0.183237 0.331115 0.110240 0.047449 -0.032527 -0.103446 -0.200660 0.219576 -0.084861 -0.213065 0.217212 -0.160297 -0.151695 -0.121686 -0.121747 -0.124478 0.100671 0.081756 0.073086 0.091748 0.088427 0.087690 0.087835 0.112272 0.109882 0.106296 0.110685 0.124336 0.105352 0.122714 0.121662 0.125481 0.127843 0.123640 0.124953 0.123948
qa: -0.0395 -0.0594 -0.2587 -0.3861 -0.2903 0.1050 -0.0477 -0.0847 -0.2378 -0.2789 -0.1832 0.3311 0.1102 0.0474 -0.0325 -0.1034 -0.2007 0.2196 -0.0849 -0.2131 0.2172 -0.1603 -0.1517 -0.1217 -0.1217 -0.1245 0.1007 0.0818 0.0731 0.0917 0.0884 0.0877 0.0878 0.1123 0.1099 0.1063 0.1107 0.1243 0.1054 0.1227 0.1217 0.1255 0.1278 0.1236 0.1250 0.1239
va: 1.3081 1.2500 2.1281 2.0835 2.1094 3.7211 3.9003 3.8528 3.9061 3.9022 3.9179 4.1627 4.1712 3.8674 3.6815 3.7969 4.0048 3.8400 3.9246 4.0418 3.8404 4.0244 3.9758 3.9733 3.9430 3.9501 1.0077 1.0354 1.0076 1.0044 1.0047 0.9978 1.0047 1.0171 1.0173 1.0119 0.9929 1.0315 1.0143 0.9992 1.0150 1.0194 1.0058 1.0009 1.0000 1.0001
dispcorr: -0.027549332 hartree
energy: -1958.448696499800
dipole: -5.49299 5.24365 -0.24934 13.67329 -12.71392 0.95937 -18.73686 18.31769 -0.41917
magnitude: 1.07623 au
magnitude: 2.73556 debye
