program: Orca
programVersion: 5.0.2
elementType: Cl Cl O O O C C C C C C C C C C C C C C C C C C C C C H H H H H H H H H H H H H H H H H H H H
charge: 0
multiplicity: 1
keywords: wb97x-d3
keywords: def2-TZVPP
keywords: def2/J RIJCOSX
keywords: DEFGRID2
keywords: scfconv7
keywords: smallprint printgap noloewdin
keywords: NOSOSCF
formula: C21H20Cl2O3
InChI: InChI=1/C21H20Cl2O3/c1-21(2)17(12-18(22)23)19(21)20(24)25-13-14-7-6-10-16(11-14)26-15-8-4-3-5-9-15/h3-12,17,19H,13H2,1-2H3
46 atoms
Cl -3.892379 -1.145662 0.13089
Cl -2.535176 -1.601478 -2.372933
O  1.400285 2.638516 0.579716
O  0.258257 2.504231 -1.341774
O  2.57983 -2.254122 -0.189142
C  -2.288975 2.707296 0.422374
C  -1.937942 1.24952 0.466389
C  -0.874326 2.302464 0.765781
C  -3.100316 3.242159 1.579595
C  -2.634275 3.36402 -0.89137
C  -1.883226 0.417146 -0.746308
C  0.280147 2.497754 -0.138718
C  -2.666984 -0.630243 -0.960676
C  2.646118 2.679611 -0.103029
C  3.323371 1.333597 -0.122849
C  2.594175 0.152577 -0.124115
C  4.711785 1.279967 -0.176423
C  3.251826 -1.070448 -0.165562
C  5.35801 0.055685 -0.241496
C  4.636824 -1.126478 -0.22847
C  1.386424 -2.367293 0.468916
C  1.242287 -1.954483 1.788333
C  0.327565 -2.955202 -0.205577
C  0.024998 -2.131732 2.425911
C  -0.881223 -3.138149 0.448775
C  -1.040632 -2.723164 1.76184
H  -2.268003 0.717007 1.351746
H  -0.609398 2.375847 1.813903
H  -2.923438 4.310644 1.715579
H  -4.166486 3.100423 1.395863
H  -2.857225 2.742864 2.518591
H  -2.438895 4.436372 -0.843248
H  -2.086425 2.967219 -1.73983
H  -3.69917 3.230409 -1.088177
H  -1.16849 0.656075 -1.522362
H  2.515581 3.052748 -1.121084
H  3.262508 3.396657 0.440599
H  1.513249 0.162507 -0.090083
H  5.291533 2.195086 -0.165077
H  6.438592 0.019339 -0.282367
H  5.135039 -2.086098 -0.262405
H  2.072873 -1.499617 2.313101
H  0.453371 -3.265025 -1.234565
H  -0.086196 -1.810869 3.453574
H  -1.707688 -3.593414 -0.080226
H  -1.989405 -2.858198 2.262613
totalener: -1958.42390671 hartree
nucrepener: 2687.26158012 hartree
electener: -4645.68548683 hartree
oneelecener: -8027.75688429 hartree
twoeener: 3382.07139746 hartree
kineticenergy: 1952.60834857 hartree
xcener: -143.518211739881 hartree
chargesum: -0.0000000
charge: -0.057740 -0.049755 -0.265897 -0.386062 -0.298634 0.123986 -0.001751 -0.094361 -0.235573 -0.254537 -0.226041 0.304827 0.062160 0.062878 0.031643 -0.144380 -0.196831 0.232198 -0.082656 -0.210196 0.238771 -0.147114 -0.191203 -0.127086 -0.102377 -0.149719 0.082532 0.087889 0.091258 0.091972 0.073240 0.088623 0.106822 0.089136 0.140250 0.113743 0.103456 0.105381 0.104980 0.123945 0.125161 0.129712 0.124540 0.125503 0.130678 0.126629
qa: -0.0577 -0.0498 -0.2659 -0.3861 -0.2986 0.1240 -0.0018 -0.0944 -0.2356 -0.2545 -0.2260 0.3048 0.0622 0.0629 0.0316 -0.1444 -0.1968 0.2322 -0.0827 -0.2102 0.2388 -0.1471 -0.1912 -0.1271 -0.1024 -0.1497 0.0825 0.0879 0.0913 0.0920 0.0732 0.0886 0.1068 0.0891 0.1403 0.1137 0.1035 0.1054 0.1050 0.1239 0.1252 0.1297 0.1245 0.1255 0.1307 0.1266
va: 1.2703 1.2613 2.1357 2.0874 2.1126 3.7541 3.8379 3.9387 3.9047 3.9167 3.8469 4.2019 4.2540 3.8706 3.7444 3.9359 4.0077 3.8424 3.9593 4.0354 3.8126 3.9362 3.9937 3.9377 3.8344 3.9088 1.0265 1.0316 1.0042 1.0054 1.0082 1.0028 1.0185 1.0023 1.0298 1.0099 0.9928 1.0059 1.0114 0.9995 1.0137 1.0034 1.0182 0.9996 1.0119 1.0078
dispcorr: -0.028014239 hartree
energy: -1958.451920946741
dipole: 9.72242 -9.55654 0.16588 20.62638 -19.75348 0.87290 11.83940 -10.87974 0.95966
magnitude: 1.30783 au
magnitude: 3.32423 debye
