program: Orca
programVersion: 5.0.2
elementType: Cl Cl O O O C C C C C C C C C C C C C C C C C C C C C H H H H H H H H H H H H H H H H H H H H
charge: 0
multiplicity: 1
keywords: wb97x-d3
keywords: def2-TZVPP
keywords: def2/J RIJCOSX
keywords: DEFGRID2
keywords: scfconv7
keywords: smallprint printgap noloewdin
keywords: NOSOSCF
formula: C21H20Cl2O3
InChI: InChI=1/C21H20Cl2O3/c1-21(2)17(12-18(22)23)19(21)20(24)25-13-14-7-6-10-16(11-14)26-15-8-4-3-5-9-15/h3-12,17,19H,13H2,1-2H3
46 atoms
Cl -1.573445 -0.549788 1.86525
Cl -1.984045 -1.586858 -0.800657
O  0.217322 2.208553 -0.979423
O  1.236507 3.636761 0.403354
O  2.043465 -2.181836 1.0742
C  -2.357074 3.594719 0.072529
C  -2.214137 2.216664 0.637069
C  -1.058011 3.201635 0.743172
C  -3.217748 4.565407 0.846902
C  -2.429171 3.815564 -1.418769
C  -2.183756 1.017773 -0.220749
C  0.246911 3.054253 0.055353
C  -1.959385 -0.210084 0.226403
C  1.466081 1.900795 -1.596407
C  2.304241 0.995595 -0.737524
C  1.764912 -0.196816 -0.267332
C  3.605695 1.343094 -0.406915
C  2.534695 -1.036292 0.524835
C  4.371175 0.492701 0.376185
C  3.843644 -0.698608 0.842993
C  1.208636 -3.001418 0.374563
C  0.227696 -3.662814 1.100621
C  1.351577 -3.235356 -0.987422
C  -0.608864 -4.562683 0.462211
C  0.497129 -4.128173 -1.615939
C  -0.48453 -4.796247 -0.899262
H  -2.702917 2.050746 1.592252
H  -0.912666 3.628856 1.72852
H  -4.261547 4.484824 0.538173
H  -3.176546 4.381279 1.920849
H  -2.896305 5.593763 0.674723
H  -1.79699 3.147762 -1.99736
H  -3.456773 3.686702 -1.763948
H  -2.128811 4.836281 -1.660245
H  -2.392694 1.120774 -1.277383
H  1.193049 1.405012 -2.528548
H  2.011658 2.81316 -1.845013
H  0.745071 -0.465828 -0.513162
H  4.014685 2.285736 -0.745892
H  5.386028 0.763729 0.634451
H  4.430519 -1.364631 1.461619
H  0.127609 -3.466278 2.159498
H  2.122926 -2.73139 -1.555134
H  -1.372449 -5.073914 1.03323
H  0.610099 -4.308365 -2.676995
H  -1.143647 -5.494656 -1.396773
totalener: -1958.41868759 hartree
nucrepener: 2729.76778365 hartree
electener: -4688.18647124 hartree
oneelecener: -8113.19914185 hartree
twoeener: 3425.01267061 hartree
kineticenergy: 1952.64510840 hartree
xcener: -143.523619356457 hartree
chargesum: -0.0000000
charge: -0.046521 -0.050250 -0.273456 -0.349363 -0.295357 0.090244 -0.016973 -0.096470 -0.237119 -0.279009 -0.148997 0.352251 0.042408 0.025313 0.020119 -0.217976 -0.137588 0.280201 -0.081889 -0.220267 0.288717 -0.258750 -0.168552 -0.057644 -0.110948 -0.170607 0.094715 0.087210 0.088296 0.074819 0.094388 0.085622 0.098525 0.097210 0.109643 0.105041 0.104215 0.108890 0.106019 0.122876 0.123652 0.122131 0.126316 0.122134 0.123493 0.123285
qa: -0.0465 -0.0502 -0.2735 -0.3494 -0.2954 0.0902 -0.0170 -0.0965 -0.2371 -0.2790 -0.1490 0.3523 0.0424 0.0253 0.0201 -0.2180 -0.1376 0.2802 -0.0819 -0.2203 0.2887 -0.2588 -0.1686 -0.0576 -0.1109 -0.1706 0.0947 0.0872 0.0883 0.0748 0.0944 0.0856 0.0985 0.0972 0.1096 0.1050 0.1042 0.1089 0.1060 0.1229 0.1237 0.1221 0.1263 0.1221 0.1235 0.1233
va: 1.2819 1.2625 2.0864 2.1622 2.1138 3.8031 3.7755 3.8638 3.9056 3.9097 3.8913 4.2186 4.2026 3.8854 3.7430 3.9637 3.9873 3.7658 3.9402 4.0384 3.7358 4.0081 3.9304 3.8975 3.9207 3.9465 1.0194 1.0288 1.0039 1.0086 1.0040 1.0168 0.9992 1.0033 1.0218 0.9932 1.0085 1.0211 1.0145 0.9999 1.0135 1.0210 1.0067 0.9989 1.0008 1.0015
dispcorr: -0.029052315 hartree
energy: -1958.447739902653
dipole: -0.72265 -0.03626 -0.75891 18.80287 -18.42535 0.37752 -7.94554 7.20888 -0.73667
magnitude: 1.12301 au
magnitude: 2.85446 debye
