program: Orca
programVersion: 5.0.2
elementType: Cl Cl O O O C C C C C C C C C C C C C C C C C C C C C H H H H H H H H H H H H H H H H H H H H
charge: 0
multiplicity: 1
keywords: wb97x-d3
keywords: def2-TZVPP
keywords: def2/J RIJCOSX
keywords: DEFGRID2
keywords: scfconv7
keywords: smallprint printgap noloewdin
keywords: NOSOSCF
formula: C21H20Cl2O3
InChI: InChI=1/C21H20Cl2O3/c1-21(2)17(12-18(22)23)19(21)20(24)25-13-14-7-6-10-16(11-14)26-15-8-4-3-5-9-15/h3-12,17,19H,13H2,1-2H3
46 atoms
Cl -1.760686 -0.120549 -0.016292
Cl -2.076605 0.045604 -2.883081
O  0.692118 2.66008 1.07095
O  0.054289 3.191455 -1.006515
O  1.331768 -2.549943 1.590447
C  -2.567721 4.230091 0.236741
C  -2.752236 2.75972 0.071882
C  -1.516494 3.296494 0.793861
C  -3.430292 4.903478 1.280202
C  -2.293933 5.113235 -0.955645
C  -2.624133 2.088896 -1.239084
C  -0.198721 3.068525 0.162969
C  -2.219214 0.833049 -1.364211
C  1.932324 2.14391 0.577504
C  1.756015 0.73034 0.099225
C  1.680264 -0.297966 1.031889
C  1.61461 0.439963 -1.251653
C  1.455295 -1.600805 0.618133
C  1.389441 -0.867282 -1.657051
C  1.303494 -1.893259 -0.731931
C  1.869971 -3.78972 1.414736
C  1.167967 -4.862409 1.947001
C  3.091255 -3.993703 0.783012
C  1.689796 -6.14213 1.844899
C  3.59582 -5.280706 0.679587
C  2.901305 -6.360012 1.20574
H  -3.463608 2.286264 0.743189
H  -1.5195 3.166789 1.869494
H  -2.949993 5.80793 1.656798
H  -4.394053 5.18931 0.855459
H  -3.626152 4.252622 2.133292
H  -1.684619 4.641451 -1.719881
H  -3.239995 5.416991 -1.408181
H  -1.776738 6.020895 -0.640993
H  -2.871255 2.63245 -2.141857
H  2.335495 2.783137 -0.209186
H  2.608524 2.185069 1.431026
H  1.78618 -0.091469 2.090393
H  1.657117 1.235322 -1.982591
H  1.260684 -1.088995 -2.707762
H  1.110669 -2.907221 -1.057475
H  0.220504 -4.686404 2.439267
H  3.646752 -3.158407 0.376649
H  1.138697 -6.97463 2.262151
H  4.546425 -5.436357 0.186569
H  3.302256 -7.360752 1.120541
totalener: -1958.42099046 hartree
nucrepener: 2637.43989339 hartree
electener: -4595.86088385 hartree
oneelecener: -7928.90585904 hartree
twoeener: 3333.04497519 hartree
kineticenergy: 1952.64523631 hartree
xcener: -143.521752333383 hartree
chargesum: -0.0000000
charge: -0.041029 -0.053618 -0.260354 -0.389861 -0.300035 0.110921 -0.060895 -0.084518 -0.238479 -0.276544 -0.167295 0.342879 0.091515 0.057385 0.005366 -0.228670 -0.113311 0.212448 -0.156486 -0.130884 0.256999 -0.214991 -0.169464 -0.089922 -0.117200 -0.147624 0.102350 0.081144 0.091688 0.089517 0.073752 0.107002 0.089093 0.087203 0.108969 0.108987 0.105753 0.107209 0.123036 0.126239 0.131592 0.123746 0.131578 0.124188 0.126084 0.124534
qa: -0.0410 -0.0536 -0.2604 -0.3899 -0.3000 0.1109 -0.0609 -0.0845 -0.2385 -0.2765 -0.1673 0.3429 0.0915 0.0574 0.0054 -0.2287 -0.1133 0.2124 -0.1565 -0.1309 0.2570 -0.2150 -0.1695 -0.0899 -0.1172 -0.1476 0.1024 0.0811 0.0917 0.0895 0.0738 0.1070 0.0891 0.0872 0.1090 0.1090 0.1058 0.1072 0.1230 0.1262 0.1316 0.1237 0.1316 0.1242 0.1261 0.1245
va: 1.3026 1.2548 2.1284 2.0863 2.1024 3.7365 3.8978 3.8633 3.9042 3.8982 3.9127 4.1641 4.1865 3.8553 3.6460 4.0688 3.8874 3.8330 3.9466 3.9090 3.8048 4.0370 3.9351 3.9351 3.9472 3.9624 1.0090 1.0350 1.0047 1.0046 1.0071 1.0197 0.9977 1.0047 1.0191 1.0106 0.9948 1.0272 1.0239 1.0073 1.0025 1.0148 1.0053 0.9989 1.0000 1.0006
dispcorr: -0.026935133 hartree
energy: -1958.447925588728
dipole: 3.81941 -3.94293 -0.12352 13.27050 -12.92216 0.34834 9.06434 -8.72084 0.34350
magnitude: 0.50457 au
magnitude: 1.28251 debye
