program: Orca
programVersion: 5.0.2
elementType: Cl Cl O O O C C C C C C C C C C C C C C C C C C C C C H H H H H H H H H H H H H H H H H H H H
charge: 0
multiplicity: 1
keywords: wb97x-d3
keywords: def2-TZVPP
keywords: def2/J RIJCOSX
keywords: DEFGRID2
keywords: scfconv7
keywords: smallprint printgap noloewdin
keywords: NOSOSCF
formula: C21H20Cl2O3
InChI: InChI=1/C21H20Cl2O3/c1-21(2)17(12-18(22)23)19(21)20(24)25-13-14-7-6-10-16(11-14)26-15-8-4-3-5-9-15/h3-12,17,19H,13H2,1-2H3
46 atoms
Cl -1.856972 -1.014464 -0.430277
Cl -0.773541 -0.433403 -3.041221
O  0.50647 2.187821 1.644406
O  0.419894 3.22301 -0.332366
O  1.286689 -2.52693 -0.395197
C  -2.618706 3.450557 0.030775
C  -2.439523 1.989537 -0.231387
C  -1.603326 2.691189 0.844108
C  -3.871835 3.830826 0.787754
C  -2.223109 4.490033 -0.98916
C  -1.789287 1.463529 -1.445369
C  -0.141357 2.763666 0.624541
C  -1.510535 0.178201 -1.619966
C  1.905766 1.982257 1.463584
C  2.188337 0.934771 0.422037
C  1.594119 -0.318149 0.531617
C  3.029124 1.209952 -0.64635
C  1.863285 -1.293157 -0.41868
C  3.289025 0.230183 -1.592373
C  2.714261 -1.023518 -1.482561
C  1.022097 -3.151618 0.786309
C  -0.161387 -3.871947 0.871185
C  1.91516 -3.139875 1.851854
C  -0.45396 -4.575141 2.02924
C  1.60554 -3.841504 3.006471
C  0.42196 -4.558428 3.104341
H  -3.20195 1.3379 0.182256
H  -1.881991 2.449941 1.863409
H  -3.730161 4.770275 1.324405
H  -4.710782 3.960544 0.102184
H  -4.156652 3.072016 1.517823
H  -3.050669 4.649079 -1.682968
H  -2.022014 5.44136 -0.494468
H  -1.3377 4.238091 -1.562705
H  -1.514633 2.142613 -2.240961
H  2.40778 2.919474 1.213619
H  2.261435 1.660675 2.443087
H  0.915369 -0.527112 1.349561
H  3.46426 2.195252 -0.749572
H  3.941239 0.446478 -2.427966
H  2.908029 -1.792756 -2.218235
H  -0.838458 -3.881874 0.027397
H  2.845703 -2.591459 1.781751
H  -1.377726 -5.135259 2.090705
H  2.302591 -3.830955 3.834232
H  0.187894 -5.103975 4.008328
totalener: -1958.42093787 hartree
nucrepener: 2717.54592977 hartree
electener: -4675.96686764 hartree
oneelecener: -8089.03696102 hartree
twoeener: 3413.07009338 hartree
kineticenergy: 1952.63908424 hartree
xcener: -143.520390588295 hartree
chargesum: -0.0000000
charge: -0.061142 -0.040376 -0.267481 -0.376905 -0.283078 0.111526 -0.058444 -0.065121 -0.239077 -0.263209 -0.158879 0.333968 0.063635 0.062110 0.033105 -0.236170 -0.144731 0.248582 -0.065740 -0.239854 0.273525 -0.231498 -0.178889 -0.090407 -0.112531 -0.151038 0.090001 0.080778 0.092104 0.091329 0.073516 0.090296 0.087855 0.099354 0.117423 0.100032 0.109702 0.123530 0.103433 0.122354 0.120727 0.132962 0.128861 0.124690 0.125336 0.123834
qa: -0.0611 -0.0404 -0.2675 -0.3769 -0.2831 0.1115 -0.0584 -0.0651 -0.2391 -0.2632 -0.1589 0.3340 0.0636 0.0621 0.0331 -0.2362 -0.1447 0.2486 -0.0657 -0.2399 0.2735 -0.2315 -0.1789 -0.0904 -0.1125 -0.1510 0.0900 0.0808 0.0921 0.0913 0.0735 0.0903 0.0879 0.0994 0.1174 0.1000 0.1097 0.1235 0.1034 0.1224 0.1207 0.1330 0.1289 0.1247 0.1253 0.1238
va: 1.2743 1.2674 2.1224 2.1104 2.0944 3.7850 3.8703 3.8376 3.8993 3.8986 3.9092 4.2006 4.2020 3.8711 3.7063 3.8774 4.0051 3.7237 3.9270 4.0541 3.7919 4.0074 3.9514 3.9527 3.9395 3.9758 1.0205 1.0324 1.0048 1.0048 1.0069 0.9987 1.0038 1.0259 1.0230 1.0096 0.9902 1.0298 1.0157 0.9987 1.0157 1.0238 1.0068 0.9997 0.9998 1.0007
dispcorr: -0.027941895 hartree
energy: -1958.448879768823
dipole: -2.30394 1.99521 -0.30874 17.19952 -16.71869 0.48083 14.50716 -13.71176 0.79540
magnitude: 0.97937 au
magnitude: 2.48936 debye
