program: Orca
programVersion: 5.0.2
elementType: Cl Cl O O O C C C C C C C C C C C C C C C C C C C C C H H H H H H H H H H H H H H H H H H H H
charge: 0
multiplicity: 1
keywords: wb97x-d3
keywords: def2-TZVPP
keywords: def2/J RIJCOSX
keywords: DEFGRID2
keywords: scfconv7
keywords: smallprint printgap noloewdin
keywords: NOSOSCF
formula: C21H20Cl2O3
InChI: InChI=1/C21H20Cl2O3/c1-21(2)17(12-18(22)23)19(21)20(24)25-13-14-7-6-10-16(11-14)26-15-8-4-3-5-9-15/h3-12,17,19H,13H2,1-2H3
46 atoms
Cl -3.889542 -1.182919 0.109886
Cl -2.513358 -1.641414 -2.382538
O  1.371838 2.642494 0.582956
O  0.254782 2.478204 -1.350523
O  2.61584 -2.244693 -0.123561
C  -2.313155 2.693411 0.383957
C  -1.962353 1.236044 0.439154
C  -0.902348 2.290575 0.745256
C  -3.138555 3.233259 1.528953
C  -2.642489 3.344559 -0.936688
C  -1.893237 0.39659 -0.767934
C  0.261823 2.484558 -0.147221
C  -2.664417 -0.660892 -0.978848
C  2.624516 2.69204 -0.086271
C  3.315448 1.352791 -0.095895
C  2.600035 0.163524 -0.079573
C  4.703928 1.315278 -0.159131
C  3.271956 -1.052066 -0.115351
C  5.364109 0.098152 -0.216168
C  4.65713 -1.092114 -0.187372
C  1.414947 -2.359658 0.521071
C  0.359619 -2.936498 -0.16789
C  1.261332 -1.958054 1.84261
C  -0.855352 -3.120869 0.474674
C  0.038127 -2.136394 2.468496
C  -1.023982 -2.717643 1.79012
H  -2.302408 0.708199 1.323453
H  -0.648994 2.369497 1.795789
H  -2.963641 4.302202 1.662616
H  -4.20239 3.090825 1.333383
H  -2.906986 2.738434 2.473009
H  -2.451183 4.417625 -0.889124
H  -2.081351 2.947168 -1.77609
H  -3.704004 3.207154 -1.148433
H  -1.176125 0.63817 -1.540911
H  2.501687 3.060986 -1.106797
H  3.228079 3.416307 0.46203
H  1.519504 0.161651 -0.036406
H  5.272597 2.237346 -0.161471
H  6.444708 0.074184 -0.2643
H  5.166316 -2.046117 -0.216191
H  0.493171 -3.237062 -1.198585
H  2.089771 -1.511585 2.377674
H  -1.678629 -3.569314 -0.064789
H  -0.080826 -1.82452 3.497944
H  -1.977223 -2.85426 2.281918
totalener: -1958.42399510 hartree
nucrepener: 2685.31456411 hartree
electener: -4643.73855921 hartree
oneelecener: -8023.85728843 hartree
twoeener: 3380.11872922 hartree
kineticenergy: 1952.61103164 hartree
xcener: -143.518703268044 hartree
chargesum: -0.0000000
charge: -0.057695 -0.049591 -0.266074 -0.386528 -0.298563 0.121900 0.000702 -0.094965 -0.235551 -0.254889 -0.225428 0.305980 0.060850 0.063154 0.031326 -0.144044 -0.197693 0.232507 -0.082774 -0.210558 0.236243 -0.189931 -0.146417 -0.102174 -0.125915 -0.149284 0.081900 0.087989 0.091205 0.092079 0.073398 0.088573 0.106859 0.089471 0.140600 0.113581 0.103997 0.105433 0.104899 0.123646 0.125009 0.124269 0.130028 0.130612 0.125492 0.126374
qa: -0.0577 -0.0496 -0.2661 -0.3865 -0.2986 0.1219 0.0007 -0.0950 -0.2356 -0.2549 -0.2254 0.3060 0.0608 0.0632 0.0313 -0.1440 -0.1977 0.2325 -0.0828 -0.2106 0.2362 -0.1899 -0.1464 -0.1022 -0.1259 -0.1493 0.0819 0.0880 0.0912 0.0921 0.0734 0.0886 0.1069 0.0895 0.1406 0.1136 0.1040 0.1054 0.1049 0.1236 0.1250 0.1243 0.1300 0.1306 0.1255 0.1264
va: 1.2705 1.2617 2.1362 2.0869 2.1120 3.7550 3.8372 3.9372 3.9046 3.9166 3.8476 4.1996 4.2554 3.8718 3.7431 3.9335 4.0081 3.8423 3.9598 4.0350 3.8179 3.9958 3.9417 3.8364 3.9397 3.9115 1.0271 1.0315 1.0042 1.0053 1.0082 1.0027 1.0186 1.0023 1.0300 1.0098 0.9924 1.0075 1.0113 0.9995 1.0139 1.0185 1.0032 1.0126 0.9995 1.0080
dispcorr: -0.027916743 hartree
energy: -1958.451911844110
dipole: 9.52456 -9.38835 0.13621 20.87927 -19.98774 0.89153 11.74317 -10.78957 0.95360
magnitude: 1.31253 au
magnitude: 3.33620 debye
