program: Orca
programVersion: 5.0.2
elementType: Cl Cl O O O C C C C C C C C C C C C C C C C C C C C C H H H H H H H H H H H H H H H H H H H H
charge: 0
multiplicity: 1
keywords: wb97x-d3
keywords: def2-TZVPP
keywords: def2/J RIJCOSX
keywords: DEFGRID2
keywords: scfconv7
keywords: smallprint printgap noloewdin
keywords: NOSOSCF
formula: C21H20Cl2O3
InChI: InChI=1/C21H20Cl2O3/c1-21(2)17(12-18(22)23)19(21)20(24)25-13-14-7-6-10-16(11-14)26-15-8-4-3-5-9-15/h3-12,17,19H,13H2,1-2H3
46 atoms
Cl -1.411645 1.060782 2.758668
Cl -2.117432 -1.175913 1.079082
O  1.180207 3.196261 -0.568179
O  -0.213392 1.905101 -1.743896
O  2.618266 -2.48532 -1.086093
C  -2.495897 3.745764 -0.78819
C  -2.234724 2.830109 0.363851
C  -1.080547 3.599726 -0.287363
C  -3.151466 5.065727 -0.448189
C  -2.930332 3.215987 -2.133262
C  -2.310003 1.362699 0.247284
C  -0.035151 2.806984 -0.970815
C  -1.98934 0.530732 1.229078
C  2.264755 2.351086 -0.944684
C  2.199515 1.018176 -0.249859
C  2.401031 -0.149728 -0.970129
C  1.930822 0.94618 1.112445
C  2.360097 -1.379725 -0.330947
C  1.875971 -0.288111 1.739524
C  2.097825 -1.457067 1.030326
C  1.873668 -3.615115 -0.912752
C  2.528097 -4.830746 -1.051956
C  0.507477 -3.575301 -0.659998
C  1.810905 -6.011417 -0.937785
C  -0.193912 -4.764506 -0.5380
C  0.449719 -5.985995 -0.673028
H  -2.499394 3.212292 1.344121
H  -0.695405 4.425403 0.299607
H  -4.237712 4.962922 -0.435728
H  -2.843757 5.438954 0.529568
H  -2.896695 5.826578 -1.187609
H  -2.691426 3.940583 -2.912974
H  -2.460557 2.279055 -2.413802
H  -4.012716 3.075642 -2.13669
H  -2.644009 0.919663 -0.680861
H  2.300301 2.221128 -2.028507
H  3.156651 2.901593 -0.64319
H  2.574376 -0.114783 -2.038541
H  1.752618 1.846905 1.685231
H  1.659566 -0.343713 2.797805
H  2.059357 -2.415542 1.531219
H  3.591344 -4.843613 -1.252437
H  -0.007005 -2.628264 -0.559495
H  2.325173 -6.957029 -1.048411
H  -1.257171 -4.730914 -0.339449
H  -0.105472 -6.909143 -0.576987
totalener: -1958.42234627 hartree
nucrepener: 2648.42444645 hartree
electener: -4606.84679272 hartree
oneelecener: -7950.51707345 hartree
twoeener: 3343.67028073 hartree
kineticenergy: 1952.62905727 hartree
xcener: -143.518067443474 hartree
chargesum: -0.0000000
charge: -0.058799 -0.054811 -0.272691 -0.379879 -0.302040 0.106004 -0.058075 -0.059039 -0.234678 -0.270669 -0.138784 0.331437 0.058317 0.066702 0.059726 -0.182921 -0.218294 0.228321 -0.109190 -0.169762 0.231352 -0.207938 -0.142497 -0.094942 -0.117922 -0.142850 0.090828 0.082935 0.091549 0.073435 0.092223 0.087508 0.103089 0.093262 0.112852 0.101663 0.108799 0.103577 0.117662 0.126682 0.130685 0.122840 0.126151 0.123295 0.121527 0.123360
qa: -0.0588 -0.0548 -0.2727 -0.3799 -0.3020 0.1060 -0.0581 -0.0590 -0.2347 -0.2707 -0.1388 0.3314 0.0583 0.0667 0.0597 -0.1829 -0.2183 0.2283 -0.1092 -0.1698 0.2314 -0.2079 -0.1425 -0.0949 -0.1179 -0.1429 0.0908 0.0829 0.0915 0.0734 0.0922 0.0875 0.1031 0.0933 0.1129 0.1017 0.1088 0.1036 0.1177 0.1267 0.1307 0.1228 0.1262 0.1233 0.1215 0.1234
va: 1.2688 1.2560 2.1233 2.1048 2.1057 3.7948 3.8646 3.8425 3.8984 3.8996 3.8827 4.1830 4.1851 3.8575 3.6620 4.0804 3.9410 3.8662 3.8845 3.9595 3.8544 4.0307 3.9162 3.9384 3.9452 3.9653 1.0195 1.0313 1.0046 1.0072 1.0050 1.0040 1.0247 0.9984 1.0250 1.0099 0.9886 1.0256 1.0254 1.0062 1.0036 1.0145 1.0226 0.9989 1.0021 1.0006
dispcorr: -0.026728870 hartree
energy: -1958.449075140159
dipole: -1.54304 1.18496 -0.35808 11.76205 -10.82994 0.93211 -14.53824 14.72172 0.18348
magnitude: 1.01524 au
magnitude: 2.58054 debye
