program: Orca
programVersion: 5.0.2
elementType: Cl Cl O O O C C C C C C C C C C C C C C C C C C C C C H H H H H H H H H H H H H H H H H H H H
charge: 0
multiplicity: 1
keywords: wb97x-d3
keywords: def2-TZVPP
keywords: def2/J RIJCOSX
keywords: DEFGRID2
keywords: scfconv7
keywords: smallprint printgap noloewdin
keywords: NOSOSCF
formula: C21H20Cl2O3
InChI: InChI=1/C21H20Cl2O3/c1-21(2)17(12-18(22)23)19(21)20(24)25-13-14-7-6-10-16(11-14)26-15-8-4-3-5-9-15/h3-12,17,19H,13H2,1-2H3
46 atoms
Cl -0.844891 0.228407 1.393748
Cl -2.618612 -1.458459 -0.141452
O  1.020712 3.073296 -0.392054
O  -0.318417 1.805306 -1.660319
O  2.527688 -2.439406 -1.063077
C  -2.568684 3.729179 -0.658517
C  -2.537817 2.592102 0.306888
C  -1.247841 3.314595 -0.042312
C  -3.130137 5.041872 -0.164934
C  -2.856716 3.4696 -2.116479
C  -2.826911 1.205873 -0.117803
C  -0.174723 2.631555 -0.800348
C  -2.184263 0.136321 0.326339
C  2.170742 2.409785 -0.915397
C  2.394448 1.091634 -0.231253
C  2.319714 -0.096111 -0.94417
C  2.653984 1.055931 1.134622
C  2.536352 -1.306281 -0.303103
C  2.849207 -0.158257 1.772045
C  2.797687 -1.346219 1.059433
C  1.738842 -3.491591 -0.702011
C  2.157375 -4.753584 -1.102593
C  0.544943 -3.332364 -0.011167
C  1.375124 -5.858478 -0.808673
C  -0.223757 -4.448709 0.280415
C  0.184084 -5.714452 -0.111459
H  -2.885662 2.815215 1.312844
H  -0.873658 3.971905 0.733585
H  -4.212796 5.071486 -0.299493
H  -2.92489 5.203169 0.894074
H  -2.703695 5.88054 -0.717233
H  -3.935265 3.486577 -2.285201
H  -2.418428 4.254265 -2.734948
H  -2.471656 2.518062 -2.471891
H  -3.648476 1.041869 -0.804743
H  2.091794 2.283709 -1.99661
H  2.996516 3.092473 -0.71336
H  2.085936 -0.08853 -2.000994
H  2.704609 1.977443 1.701174
H  3.055421 -0.184097 2.833867
H  2.96233 -2.293228 1.55696
H  3.087788 -4.859208 -1.644892
H  0.206804 -2.350054 0.288688
H  1.704381 -6.839958 -1.123515
H  -1.155553 -4.317071 0.814727
H  -0.422397 -6.579849 0.118502
totalener: -1958.42179580 hartree
nucrepener: 2689.55893297 hartree
electener: -4647.98072877 hartree
oneelecener: -8033.07334460 hartree
twoeener: 3385.09261583 hartree
kineticenergy: 1952.64355491 hartree
xcener: -143.520700579611 hartree
chargesum: 0.0000000
charge: -0.046292 -0.049127 -0.263178 -0.375948 -0.301057 0.103569 -0.036005 -0.082763 -0.237200 -0.279550 -0.191957 0.318797 0.112362 0.060489 0.008646 -0.127539 -0.216134 0.188359 -0.105101 -0.139331 0.216339 -0.196639 -0.087455 -0.104312 -0.130855 -0.137777 0.100296 0.081978 0.088798 0.072973 0.092199 0.088331 0.088885 0.113801 0.112631 0.101964 0.113279 0.111805 0.111392 0.126674 0.132514 0.122240 0.075752 0.121260 0.120546 0.122343
qa: -0.0463 -0.0491 -0.2632 -0.3759 -0.3011 0.1036 -0.0360 -0.0828 -0.2372 -0.2796 -0.1920 0.3188 0.1124 0.0605 0.0086 -0.1275 -0.2161 0.1884 -0.1051 -0.1393 0.2163 -0.1966 -0.0875 -0.1043 -0.1309 -0.1378 0.1003 0.0820 0.0888 0.0730 0.0922 0.0883 0.0889 0.1138 0.1126 0.1020 0.1133 0.1118 0.1114 0.1267 0.1325 0.1222 0.0758 0.1213 0.1205 0.1223
va: 1.3021 1.2640 2.1223 2.0998 2.1045 3.7192 3.8883 3.8502 3.9054 3.9061 3.9198 4.1774 4.1818 3.8530 3.6326 4.0081 3.9817 3.8991 3.9029 3.9637 3.8521 4.0059 3.8671 3.9561 3.9521 3.9662 1.0076 1.0356 1.0047 1.0076 1.0044 0.9983 1.0044 1.0152 1.0151 1.0130 0.9908 1.0283 1.0179 1.0000 1.0021 1.0150 1.0590 0.9993 1.0103 1.0010
dispcorr: -0.027543287 hartree
energy: -1958.449339085971
dipole: -1.38716 1.01478 -0.37237 16.39925 -15.27435 1.12490 -5.31099 5.81365 0.50266
magnitude: 1.28713 au
magnitude: 3.27164 debye
