program: Orca
programVersion: 5.0.2
elementType: Cl Cl O O O C C C C C C C C C C C C C C C C C C C C C H H H H H H H H H H H H H H H H H H H H
charge: 0
multiplicity: 1
keywords: wb97x-d3
keywords: def2-TZVPP
keywords: def2/J RIJCOSX
keywords: DEFGRID2
keywords: scfconv7
keywords: smallprint printgap noloewdin
keywords: NOSOSCF
formula: C21H20Cl2O3
InChI: InChI=1/C21H20Cl2O3/c1-21(2)17(12-18(22)23)19(21)20(24)25-13-14-7-6-10-16(11-14)26-15-8-4-3-5-9-15/h3-12,17,19H,13H2,1-2H3
46 atoms
Cl -2.687787 -0.757942 1.748308
Cl -2.293618 -1.714847 -0.943618
O  1.326282 3.135314 0.070746
O  0.076574 2.622484 -1.713265
O  1.989404 -2.031387 -1.03633
C  -2.377019 3.427869 -0.016769
C  -2.033324 2.072446 0.533179
C  -0.9536 3.153959 0.3900
C  -3.13437 4.34134 0.919442
C  -2.786515 3.612709 -1.457696
C  -2.019883 0.867464 -0.304519
C  0.164514 2.944388 -0.552612
C  -2.290719 -0.36162 0.119874
C  2.547668 2.792716 -0.603911
C  2.947274 1.39054 -0.24174
C  2.291908 0.300112 -0.811439
C  3.937469 1.167802 0.707483
C  2.62718 -0.984611 -0.423572
C  4.274109 -0.12725 1.080435
C  3.620109 -1.212241 0.521134
C  1.205705 -2.868971 -0.294759
C  0.919739 -4.104688 -0.864992
C  0.678144 -2.524866 0.943622
C  0.102384 -4.997019 -0.190069
C  -0.132997 -3.434053 1.609632
C  -0.423964 -4.670588 1.053654
H  -2.318703 1.906859 1.565114
H  -0.644413 3.584787 1.335232
H  -2.965824 5.388195 0.658763
H  -4.207151 4.150631 0.856281
H  -2.833059 4.205307 1.958913
H  -2.550701 4.626041 -1.788644
H  -2.318129 2.92619 -2.155213
H  -3.866938 3.48523 -1.543078
H  -1.786774 0.967937 -1.356289
H  2.448248 2.920541 -1.681671
H  3.287101 3.507607 -0.245994
H  1.524211 0.442193 -1.561532
H  4.451866 2.008587 1.156612
H  5.052074 -0.292706 1.814222
H  3.880326 -2.223215 0.809925
H  1.335162 -4.358433 -1.832636
H  0.879165 -1.559557 1.390236
H  -0.116896 -5.957751 -0.638464
H  -0.543784 -3.163208 2.573484
H  -1.057884 -5.37161 1.580613
elementType: Cl O C H
totalener: -1958.44542227 hartree
nucrepener: 2669.88335783 hartree
electener: -4628.32878010 hartree
oneelecener: -7994.32214862 hartree
twoeener: 3365.99336853 hartree
cpcmener: -0.02248640 hartree
kineticenergy: 1952.56510086 hartree
xcener: -143.508480546607 hartree
chargesum: -0.0000000
charge: -0.060990 -0.060277 -0.283789 -0.463589 -0.327024 0.087582 0.049873 -0.089266 -0.255773 -0.275211 -0.235574 0.404250 0.053898 0.079676 -0.026878 -0.184992 -0.188556 0.211230 -0.135859 -0.165597 0.304039 -0.246824 -0.178601 -0.130593 -0.185563 -0.181975 0.091775 0.099359 0.095307 0.096622 0.088545 0.101148 0.098532 0.096332 0.133310 0.119738 0.113757 0.139660 0.142854 0.159057 0.156533 0.144077 0.143600 0.155897 0.153586 0.156693
qa: -0.0610 -0.0603 -0.2838 -0.4636 -0.3270 0.0876 0.0499 -0.0893 -0.2558 -0.2752 -0.2356 0.4042 0.0539 0.0797 -0.0269 -0.1850 -0.1886 0.2112 -0.1359 -0.1656 0.3040 -0.2468 -0.1786 -0.1306 -0.1856 -0.1820 0.0918 0.0994 0.0953 0.0966 0.0885 0.1011 0.0985 0.0963 0.1333 0.1197 0.1138 0.1397 0.1429 0.1591 0.1565 0.1441 0.1436 0.1559 0.1536 0.1567
va: 1.2666 1.2455 2.1287 2.0301 2.0663 3.7675 3.7951 3.8757 3.9035 3.8911 3.9041 4.1267 4.2094 3.8020 3.7201 3.9820 3.9644 3.8057 3.8917 3.9542 3.6570 3.9871 3.7927 3.9083 3.9028 3.9055 1.0281 1.0298 1.0024 1.0019 1.0049 0.9990 1.0167 1.0012 1.0269 1.0158 0.9996 1.0315 1.0026 0.9898 0.9961 1.0089 1.0072 0.9889 0.9985 0.9896
dispcorr: -0.026752837 hartree
energy: -1958.472175107031
dipole: 5.13270 -4.79486 0.33784 19.55766 -18.20945 1.34821 1.01993 0.23571 1.25564
magnitude: 1.87309 au
magnitude: 4.76101 debye
