program: Orca
programVersion: 5.0.2
elementType: Cl Cl O O O C C C C C C C C C C C C C C C C C C C C C H H H H H H H H H H H H H H H H H H H H
charge: 0
multiplicity: 1
keywords: wb97x-d3
keywords: def2-TZVPP
keywords: def2/J RIJCOSX
keywords: DEFGRID2
keywords: scfconv7
keywords: smallprint printgap noloewdin
keywords: NOSOSCF
formula: C21H20Cl2O3
InChI: InChI=1/C21H20Cl2O3/c1-21(2)17(12-18(22)23)19(21)20(24)25-13-14-7-6-10-16(11-14)26-15-8-4-3-5-9-15/h3-12,17,19H,13H2,1-2H3
46 atoms
Cl -1.147225 -0.511073 -1.304108
Cl -1.128753 0.796254 -3.878451
O  0.393809 1.91055 1.418197
O  0.034122 3.046547 -0.473298
O  2.324962 -2.976987 0.310329
C  -2.932407 3.183703 0.42049
C  -2.780194 1.898791 -0.317092
C  -1.813646 2.240655 0.81734
C  -4.063898 3.266806 1.41791
C  -2.658144 4.499968 -0.262294
C  -2.322132 1.858108 -1.721787
C  -0.3925 2.464868 0.49509
C  -1.633468 0.848662 -2.233968
C  1.803493 1.839347 1.147388
C  2.092403 0.692671 0.221171
C  2.067221 -0.603134 0.730647
C  2.335578 0.900261 -1.131206
C  2.268413 -1.682344 -0.118092
C  2.544969 -0.186454 -1.968582
C  2.504077 -1.477829 -1.472291
C  1.626779 -3.424528 1.395645
C  0.328012 -3.021376 1.682973
C  2.254775 -4.384692 2.178636
C  -0.332193 -3.583799 2.766285
C  1.57783 -4.94721 3.250395
C  0.284009 -4.54645 3.553702
H  -3.474334 1.105626 -0.052638
H  -1.976492 1.687384 1.734545
H  -3.839957 3.993485 2.201091
H  -4.986175 3.581151 0.925275
H  -4.256692 2.307313 1.899844
H  -1.881967 4.457135 -1.020933
H  -3.571732 4.853391 -0.744675
H  -2.363139 5.253721 0.469832
H  -2.575193 2.680168 -2.381089
H  2.175271 2.784558 0.750573
H  2.262448 1.67885 2.122065
H  1.902239 -0.755031 1.790941
H  2.365941 1.904926 -1.531366
H  2.734836 -0.027594 -3.022229
H  2.663735 -2.326627 -2.125553
H  -0.175244 -2.281603 1.074507
H  3.265236 -4.694095 1.941656
H  -1.343736 -3.268095 2.987078
H  2.071262 -5.6983 3.853823
H  -0.240943 -4.982395 4.39334
elementType: Cl O C H
totalener: -1958.44430145 hartree
nucrepener: 2668.36483373 hartree
electener: -4626.80913518 hartree
oneelecener: -7991.43822402 hartree
twoeener: 3364.62908884 hartree
cpcmener: -0.02384548 hartree
kineticenergy: 1952.57899124 hartree
xcener: -143.511283544996 hartree
chargesum: 0.0000000
charge: -0.055667 -0.060719 -0.282575 -0.456909 -0.323924 0.112407 -0.045240 -0.093387 -0.259673 -0.290940 -0.178139 0.376040 0.070644 0.086694 0.013182 -0.259615 -0.192140 0.321260 -0.134106 -0.252288 0.317122 -0.209297 -0.254130 -0.154072 -0.119442 -0.184285 0.119373 0.094561 0.096708 0.095505 0.088088 0.097187 0.099804 0.100352 0.136961 0.113057 0.121412 0.142723 0.138235 0.154039 0.144457 0.151331 0.143359 0.157289 0.157826 0.156933
qa: -0.0557 -0.0607 -0.2826 -0.4569 -0.3239 0.1124 -0.0452 -0.0934 -0.2597 -0.2909 -0.1781 0.3760 0.0706 0.0867 0.0132 -0.2596 -0.1921 0.3213 -0.1341 -0.2523 0.3171 -0.2093 -0.2541 -0.1541 -0.1194 -0.1843 0.1194 0.0946 0.0967 0.0955 0.0881 0.0972 0.0998 0.1004 0.1370 0.1131 0.1214 0.1427 0.1382 0.1540 0.1445 0.1513 0.1434 0.1573 0.1578 0.1569
va: 1.2902 1.2456 2.1197 2.0275 2.0882 3.7511 3.8668 3.8698 3.9025 3.8917 3.8657 4.1220 4.1707 3.8173 3.6078 3.9750 3.8846 3.6649 3.8989 3.9863 3.6561 3.9145 4.0094 3.9193 3.8798 3.9051 1.0069 1.0326 1.0021 1.0024 1.0043 1.0162 0.9983 1.0003 1.0076 1.0109 0.9962 1.0077 1.0171 0.9915 1.0068 0.9933 1.0098 0.9906 0.9890 0.9910
dispcorr: -0.026954308 hartree
energy: -1958.471255757749
dipole: -6.84228 5.76965 -1.07262 10.97277 -10.55967 0.41309 22.03527 -20.64515 1.39013
magnitude: 1.80378 au
magnitude: 4.58484 debye
