program: Orca
programVersion: 5.0.3
elementType: Cl Cl O O O C C C C C C C C C C C C C C C C C C C C C H H H H H H H H H H H H H H H H H H H H
charge: 0
multiplicity: 1
keywords: wb97x-d3
keywords: def2-TZVPP
keywords: def2/J RIJCOSX
keywords: DEFGRID2
keywords: scfconv7
keywords: smallprint printgap noloewdin
keywords: NOSOSCF
formula: C21H20Cl2O3
InChI: InChI=1/C21H20Cl2O3/c1-21(2)17(12-18(22)23)19(21)20(24)25-13-14-7-6-10-16(11-14)26-15-8-4-3-5-9-15/h3-12,17,19H,13H2,1-2H3
46 atoms
Cl 2.76927 -4.948382 -3.120299
Cl 5.326049 -4.601661 -1.831453
O  0.432212 0.396757 -0.706509
O  -0.524959 -1.323877 -1.774141
O  -2.937982 3.168953 2.546768
C  0.937793 -2.976521 0.452578
C  1.683962 -3.062334 -0.84732
C  1.305919 -1.706162 -0.286037
C  1.669903 -3.224661 1.750515
C  -0.488046 -3.4708 0.47924
C  3.100579 -3.439234 -0.9146
C  0.299115 -0.895449 -1.009496
C  3.647488 -4.224688 -1.83436
C  -0.504892 1.315759 -1.27692
C  -1.749993 1.416255 -0.441678
C  -1.769481 2.270307 0.653651
C  -2.875206 0.650788 -0.733462
C  -2.906226 2.363103 1.444655
C  -4.00216 0.743308 0.067669
C  -4.027708 1.60171 1.156465
C  -2.615755 4.487993 2.418442
C  -2.028247 5.102707 3.516019
C  -2.893877 5.219123 1.269398
C  -1.720816 6.452612 3.461751
C  -2.574042 6.567752 1.228225
C  -1.985985 7.191597 2.317968
H  1.080081 -3.375262 -1.691268
H  2.101692 -1.127329 0.169365
H  2.667929 -2.788806 1.772012
H  1.113234 -2.795097 2.584552
H  1.771814 -4.295576 1.933847
H  -1.069474 -2.934008 1.231334
H  -0.994359 -3.360319 -0.476058
H  -0.501193 -4.529632 0.743808
H  3.771067 -3.046355 -0.160432
H  0.020291 2.270308 -1.297212
H  -0.742526 1.034723 -2.303724
H  -0.897929 2.869055 0.892393
H  -2.86335 -0.021786 -1.579993
H  -4.875654 0.147883 -0.162282
H  -4.906791 1.685523 1.781749
H  -1.82041 4.520589 4.404185
H  -3.36063 4.746437 0.414922
H  -1.263068 6.927291 4.319656
H  -2.793621 7.13453 0.332914
H  -1.739646 8.243803 2.277527
totalener: -1958.42693019 hartree
nucrepener: 2400.70865013 hartree
electener: -4359.13558031 hartree
oneelecener: -7454.49673291 hartree
twoeener: 3095.36115260 hartree
kineticenergy: 1952.61903733 hartree
xcener: -143.512633659355 hartree
chargesum: 0.0000000
charge: -0.040995 -0.049247 -0.262356 -0.396995 -0.301910 0.069539 0.044518 -0.087432 -0.247005 -0.250974 -0.204882 0.368769 0.051274 0.043650 -0.011159 -0.156479 -0.126884 0.177268 -0.112246 -0.176466 0.226707 -0.202706 -0.140752 -0.094071 -0.128859 -0.144890 0.085750 0.077178 0.071733 0.094319 0.098205 0.088991 0.100878 0.088113 0.095783 0.105935 0.113698 0.117931 0.130793 0.127761 0.128209 0.125045 0.129129 0.123912 0.126255 0.124965
qa: -0.0410 -0.0492 -0.2624 -0.3970 -0.3019 0.0695 0.0445 -0.0874 -0.2470 -0.2510 -0.2049 0.3688 0.0513 0.0437 -0.0112 -0.1565 -0.1269 0.1773 -0.1122 -0.1765 0.2267 -0.2027 -0.1408 -0.0941 -0.1289 -0.1449 0.0857 0.0772 0.0717 0.0943 0.0982 0.0890 0.1009 0.0881 0.0958 0.1059 0.1137 0.1179 0.1308 0.1278 0.1282 0.1250 0.1291 0.1239 0.1263 0.1250
va: 1.2865 1.2558 2.1402 2.1042 2.0982 3.7603 3.8178 3.8669 3.9087 3.9145 3.9227 4.2290 4.2465 3.8627 3.6703 3.9814 3.9364 3.8774 3.9521 4.0277 3.8240 4.0221 3.9060 3.9453 3.9625 3.9574 1.0514 1.0354 1.0101 1.0042 1.0025 1.0019 1.0228 1.0012 1.0311 0.9967 1.0096 1.0138 1.0218 0.9997 1.0101 1.0139 1.0065 0.9988 1.0001 1.0003
dispcorr: -0.021485987 hartree
energy: -1958.448416174136
dipole: -24.80965 24.64578 -0.16388 24.38418 -23.64037 0.74380 21.08408 -20.43478 0.64931
magnitude: 1.00085 au
magnitude: 2.54396 debye
