program: Orca
programVersion: 5.0.3
elementType: Cl Cl O O O C C C C C C C C C C C C C C C C C C C C C H H H H H H H H H H H H H H H H H H H H
charge: 0
multiplicity: 1
keywords: wb97x-d3
keywords: def2-TZVPP
keywords: def2/J RIJCOSX
keywords: DEFGRID2
keywords: scfconv7
keywords: smallprint printgap noloewdin
keywords: NOSOSCF
formula: C21H20Cl2O3
InChI: InChI=1/C21H20Cl2O3/c1-21(2)17(12-18(22)23)19(21)20(24)25-13-14-7-6-10-16(11-14)26-15-8-4-3-5-9-15/h3-12,17,19H,13H2,1-2H3
46 atoms
Cl 4.835346 -2.09413 -1.845787
Cl 5.22506 -4.833988 -1.031862
O  -0.520603 -1.343342 1.611571
O  0.68251 -0.104966 0.189146
O  -2.9523 3.69841 -0.248255
C  0.443221 -2.811904 -1.442899
C  1.848319 -2.553313 -0.974418
C  0.707386 -2.491398 0.014076
C  -0.006136 -4.221607 -1.74316
C  -0.193464 -1.784934 -2.347827
C  2.84762 -3.622542 -0.861698
C  0.321207 -1.179013 0.584092
C  4.126853 -3.520387 -1.201694
C  -1.093229 -0.158064 2.156764
C  -2.106599 0.455485 1.229606
C  -2.047283 1.809466 0.937941
C  -3.109241 -0.32837 0.665668
C  -2.998701 2.382845 0.10266
C  -4.039431 0.247969 -0.183123
C  -3.997206 1.605558 -0.462873
C  -2.649235 4.643992 0.68761
C  -1.829098 5.69052 0.292344
C  -3.178139 4.609916 1.972346
C  -1.54156 6.710086 1.186457
C  -2.87491 5.631611 2.858743
C  -2.057139 6.684078 2.47359
H  2.241002 -1.582967 -1.2553
H  0.594193 -3.328954 0.694135
H  0.39833 -4.959765 -1.051346
H  -1.093478 -4.288779 -1.685568
H  0.291831 -4.514907 -2.75101
H  0.181959 -0.77886 -2.17924
H  0.003232 -2.043307 -3.389456
H  -1.276157 -1.764006 -2.209206
H  2.532637 -4.580242 -0.465931
H  -1.568386 -0.485195 3.082473
H  -0.317654 0.566417 2.414133
H  -1.246319 2.414059 1.345838
H  -3.160537 -1.387618 0.883383
H  -4.817757 -0.361136 -0.623723
H  -4.725134 2.063221 -1.119531
H  -1.426165 5.701162 -0.711691
H  -3.826882 3.799074 2.277717
H  -0.90181 7.524942 0.874592
H  -3.290257 5.606057 3.857617
H  -1.827587 7.479188 3.169809
totalener: -1958.42570286 hartree
nucrepener: 2433.96614911 hartree
electener: -4392.39185197 hartree
oneelecener: -7521.17378655 hartree
twoeener: 3128.78193458 hartree
kineticenergy: 1952.61984990 hartree
xcener: -143.513210989259 hartree
chargesum: -0.0000000
charge: -0.040566 -0.050062 -0.269228 -0.366483 -0.299807 0.067252 0.039470 -0.067124 -0.249158 -0.240699 -0.204861 0.322381 0.052505 0.060519 0.041491 -0.121257 -0.244919 0.208461 -0.073826 -0.210153 0.232239 -0.205510 -0.152736 -0.091758 -0.118894 -0.144485 0.084657 0.077101 0.072046 0.092505 0.098522 0.103379 0.089697 0.081759 0.095168 0.110757 0.102733 0.115557 0.117450 0.125596 0.127297 0.126242 0.130190 0.125641 0.125911 0.125000
qa: -0.0406 -0.0501 -0.2692 -0.3665 -0.2998 0.0673 0.0395 -0.0671 -0.2492 -0.2407 -0.2049 0.3224 0.0525 0.0605 0.0415 -0.1213 -0.2449 0.2085 -0.0738 -0.2102 0.2322 -0.2055 -0.1527 -0.0918 -0.1189 -0.1445 0.0847 0.0771 0.0720 0.0925 0.0985 0.1034 0.0897 0.0818 0.0952 0.1108 0.1027 0.1156 0.1175 0.1256 0.1273 0.1262 0.1302 0.1256 0.1259 0.1250
va: 1.2867 1.2548 2.1224 2.1391 2.1053 3.7748 3.8366 3.8206 3.9051 3.9100 3.9262 4.2949 4.2463 3.8652 3.6624 3.9348 3.9945 3.8521 3.9110 4.0493 3.8268 4.0352 3.9352 3.9351 3.9504 3.9605 1.0532 1.0343 1.0098 1.0041 1.0032 1.0210 1.0022 1.0049 1.0309 0.9886 1.0110 1.0175 1.0181 0.9984 1.0118 1.0138 1.0052 0.9987 1.0001 1.0005
dispcorr: -0.022281727 hartree
energy: -1958.447984590440
dipole: -35.64074 34.55458 -1.08616 13.71381 -14.11258 -0.39878 5.16188 -4.62683 0.53505
magnitude: 1.27477 au
magnitude: 3.24021 debye
