program: Orca
programVersion: 5.0.3
elementType: Cl Cl O O O C C C C C C C C C C C C C C C C C C C C C H H H H H H H H H H H H H H H H H H H H
charge: 0
multiplicity: 1
keywords: wb97x-d3
keywords: def2-TZVPP
keywords: def2/J RIJCOSX
keywords: DEFGRID2
keywords: scfconv7
keywords: smallprint printgap noloewdin
keywords: NOSOSCF
formula: C21H20Cl2O3
InChI: InChI=1/C21H20Cl2O3/c1-21(2)17(12-18(22)23)19(21)20(24)25-13-14-7-6-10-16(11-14)26-15-8-4-3-5-9-15/h3-12,17,19H,13H2,1-2H3
46 atoms
Cl 3.003965 -5.040744 -2.344665
Cl 5.503254 -3.646212 -1.979537
O  -0.359336 0.339614 -1.185545
O  -0.994253 -1.788883 -1.4834
O  -3.60113 3.578498 1.84607
C  1.238939 -2.319874 0.638476
C  1.754346 -2.640482 -0.735476
C  1.113085 -1.294933 -0.470001
C  2.218591 -1.990169 1.740122
C  0.032875 -3.079372 1.135314
C  3.192495 -2.700359 -1.027268
C  -0.191338 -0.9803 -1.097966
C  3.807425 -3.669096 -1.69463
C  -1.604241 0.828567 -1.697426
C  -2.597395 1.018951 -0.586613
C  -2.614936 2.222493 0.108989
C  -3.479167 0.003798 -0.231756
C  -3.501407 2.405027 1.162041
C  -4.36604 0.199079 0.815847
C  -4.379005 1.391484 1.520711
C  -2.496005 4.342991 2.081571
C  -2.638596 5.717552 1.959435
C  -1.285522 3.794116 2.487916
C  -1.5649 6.545642 2.247904
C  -0.217426 4.633631 2.762503
C  -0.348913 6.009696 2.644479
H  1.134187 -3.328107 -1.299069
H  1.782737 -0.446169 -0.385646
H  2.649131 -2.903014 2.154818
H  3.04162 -1.358057 1.408734
H  1.71199 -1.463154 2.549838
H  0.361273 -3.979601 1.657308
H  -0.538884 -2.476149 1.843036
H  -0.637771 -3.383453 0.336409
H  3.819503 -1.891537 -0.672406
H  -1.361072 1.783304 -2.163234
H  -1.99266 0.161108 -2.46717
H  -1.938087 3.018763 -0.177521
H  -3.467398 -0.934227 -0.769748
H  -5.05496 -0.588174 1.091863
H  -5.069011 1.548227 2.339318
H  -3.589213 6.128676 1.645973
H  -1.176452 2.722303 2.592266
H  -1.681156 7.617336 2.154684
H  0.723861 4.204489 3.079682
H  0.488218 6.658266 2.863584
totalener: -1958.42678787 hartree
nucrepener: 2428.71107698 hartree
electener: -4387.13786485 hartree
oneelecener: -7510.37322111 hartree
twoeener: 3123.23535626 hartree
kineticenergy: 1952.61797214 hartree
xcener: -143.512829045517 hartree
chargesum: -0.0000000
charge: -0.040874 -0.048260 -0.260847 -0.395099 -0.298509 0.071916 0.043299 -0.094977 -0.240571 -0.252125 -0.200728 0.365512 0.046828 0.041142 -0.002044 -0.190882 -0.154171 0.232988 -0.092133 -0.206955 0.252691 -0.214578 -0.171655 -0.088166 -0.109682 -0.148629 0.087465 0.076386 0.098363 0.070980 0.092200 0.089015 0.086484 0.102334 0.096522 0.102043 0.115444 0.119015 0.132683 0.126768 0.126392 0.125447 0.131716 0.125825 0.125740 0.125685
qa: -0.0409 -0.0483 -0.2608 -0.3951 -0.2985 0.0719 0.0433 -0.0950 -0.2406 -0.2521 -0.2007 0.3655 0.0468 0.0411 -0.0020 -0.1909 -0.1542 0.2330 -0.0921 -0.2070 0.2527 -0.2146 -0.1717 -0.0882 -0.1097 -0.1486 0.0875 0.0764 0.0984 0.0710 0.0922 0.0890 0.0865 0.1023 0.0965 0.1020 0.1154 0.1190 0.1327 0.1268 0.1264 0.1254 0.1317 0.1258 0.1257 0.1257
va: 1.2865 1.2572 2.1417 2.1052 2.1101 3.7519 3.8189 3.8810 3.9069 3.9133 3.9092 4.2302 4.2440 3.8624 3.7015 3.9747 3.9523 3.8509 3.9456 4.0354 3.8103 4.0421 3.9466 3.9301 3.9413 3.9666 1.0488 1.0366 1.0031 1.0100 1.0045 1.0015 1.0023 1.0233 1.0294 0.9992 1.0107 1.0128 1.0207 0.9993 1.0125 1.0141 1.0044 0.9988 0.9999 1.0005
dispcorr: -0.021633996 hartree
energy: -1958.448421865495
dipole: -21.45918 21.53716 0.07797 22.80704 -21.95028 0.85676 21.78389 -21.09777 0.68613
magnitude: 1.10040 au
magnitude: 2.79700 debye
