program: Orca
programVersion: 5.0.3
elementType: Cl Cl O O O C C C C C C C C C C C C C C C C C C C C C H H H H H H H H H H H H H H H H H H H H
charge: 0
multiplicity: 1
keywords: wb97x-d3
keywords: def2-TZVPP
keywords: def2/J RIJCOSX
keywords: DEFGRID2
keywords: scfconv7
keywords: smallprint printgap noloewdin
keywords: NOSOSCF
formula: C21H20Cl2O3
InChI: InChI=1/C21H20Cl2O3/c1-21(2)17(12-18(22)23)19(21)20(24)25-13-14-7-6-10-16(11-14)26-15-8-4-3-5-9-15/h3-12,17,19H,13H2,1-2H3
46 atoms
Cl 4.677251 -2.630954 -2.392258
Cl 5.098996 -5.153289 -1.055647
O  -0.374869 -1.197639 1.588837
O  0.789569 -0.079106 0.039868
O  -3.048948 3.809874 -0.199313
C  0.469771 -2.878647 -1.404067
C  1.888213 -2.642713 -0.963519
C  0.762163 -2.473108 0.02603
C  -0.016762 -4.292668 -1.612378
C  -0.142334 -1.892727 -2.368994
C  2.838234 -3.749835 -0.781278
C  0.425213 -1.117559 0.51823
C  4.041132 -3.82702 -1.336871
C  -0.906724 0.02855 2.075652
C  -1.964985 0.58836 1.165131
C  -1.995792 1.949527 0.906167
C  -2.930159 -0.242808 0.604258
C  -3.000417 2.483115 0.107702
C  -3.911039 0.29502 -0.212177
C  -3.959968 1.65868 -0.458448
C  -2.780821 4.735429 0.767242
C  -2.030548 5.843143 0.401043
C  -3.276652 4.616275 2.060603
C  -1.777061 6.836526 1.334596
C  -3.007698 5.612478 2.985709
C  -2.257651 6.724654 2.630719
H  2.319934 -1.713068 -1.316906
H  0.628705 -3.260792 0.760113
H  -1.106466 -4.327672 -1.570454
H  0.290919 -4.662436 -2.591854
H  0.359011 -4.990692 -0.864939
H  0.262137 -0.889155 -2.26595
H  0.041086 -2.222573 -3.392833
H  -1.223292 -1.832356 -2.228312
H  2.549633 -4.57326 -0.139387
H  -1.335329 -0.224183 3.046653
H  -0.11339 0.761141 2.239864
H  -1.226989 2.594064 1.315254
H  -2.914502 -1.307439 0.798546
H  -4.659095 -0.351209 -0.652336
H  -4.729734 2.085563 -1.087451
H  -1.654553 5.921451 -0.610578
H  -3.870969 3.756555 2.342576
H  -1.191862 7.699542 1.04569
H  -3.394817 5.518339 3.991817
H  -2.05264 7.49884 3.357459
totalener: -1958.42559267 hartree
nucrepener: 2424.83369098 hartree
electener: -4383.25928365 hartree
oneelecener: -7502.83731485 hartree
twoeener: 3119.57803119 hartree
kineticenergy: 1952.62501913 hartree
xcener: -143.514247906972 hartree
chargesum: 0.0000000
charge: -0.040498 -0.047972 -0.271893 -0.364393 -0.299741 0.072049 0.038589 -0.081319 -0.237587 -0.241968 -0.201379 0.316287 0.044966 0.065410 0.064993 -0.143472 -0.250298 0.210666 -0.071677 -0.210639 0.229227 -0.203818 -0.151044 -0.092735 -0.119826 -0.143702 0.088873 0.076247 0.091809 0.098699 0.070456 0.103609 0.090764 0.080825 0.099058 0.107869 0.103415 0.114910 0.119127 0.125298 0.126850 0.126776 0.130290 0.125777 0.126201 0.124924
qa: -0.0405 -0.0480 -0.2719 -0.3644 -0.2997 0.0720 0.0386 -0.0813 -0.2376 -0.2420 -0.2014 0.3163 0.0450 0.0654 0.0650 -0.1435 -0.2503 0.2107 -0.0717 -0.2106 0.2292 -0.2038 -0.1510 -0.0927 -0.1198 -0.1437 0.0889 0.0762 0.0918 0.0987 0.0705 0.1036 0.0908 0.0808 0.0991 0.1079 0.1034 0.1149 0.1191 0.1253 0.1268 0.1268 0.1303 0.1258 0.1262 0.1249
va: 1.2869 1.2579 2.1203 2.1401 2.1055 3.7698 3.8302 3.8471 3.9020 3.9076 3.9039 4.2886 4.2429 3.8635 3.6469 3.9588 3.9954 3.8521 3.9126 4.0504 3.8287 4.0333 3.9319 3.9351 3.9502 3.9599 1.0489 1.0366 1.0047 1.0039 1.0093 1.0216 1.0022 1.0055 1.0268 0.9877 1.0116 1.0159 1.0186 0.9984 1.0119 1.0135 1.0049 0.9988 1.0001 1.0005
dispcorr: -0.022333132 hartree
energy: -1958.447925806083
dipole: -34.70110 33.68510 -1.01600 16.06685 -16.39530 -0.32845 7.50556 -6.83592 0.66963
magnitude: 1.26037 au
magnitude: 3.20361 debye
