program: Orca
programVersion: 5.0.3
elementType: Cl Cl O O O C C C C C C C C C C C C C C C C C C C C C H H H H H H H H H H H H H H H H H H H H
charge: 0
multiplicity: 1
keywords: wb97x-d3
keywords: def2-TZVPP
keywords: def2/J RIJCOSX
keywords: DEFGRID2
keywords: scfconv7
keywords: smallprint printgap noloewdin
keywords: NOSOSCF
formula: C21H20Cl2O3
InChI: InChI=1/C21H20Cl2O3/c1-21(2)17(12-18(22)23)19(21)20(24)25-13-14-7-6-10-16(11-14)26-15-8-4-3-5-9-15/h3-12,17,19H,13H2,1-2H3
46 atoms
Cl 2.017165 -6.00575 -2.206713
Cl 4.577187 -5.084073 -3.166881
O  -0.029642 -0.063317 -1.342717
O  -0.89347 -2.006954 -0.638748
O  -1.243527 4.376678 1.450005
C  1.990183 -2.439404 0.48343
C  1.847152 -3.177379 -0.816354
C  1.478067 -1.708991 -0.739409
C  3.362675 -2.036917 0.968855
C  1.058643 -2.811459 1.611575
C  3.010212 -3.571431 -1.620692
C  0.058068 -1.313426 -0.88518
C  3.169221 -4.733057 -2.242525
C  -1.332861 0.512493 -1.473882
C  -1.754394 1.180374 -0.196258
C  -1.352888 2.487361 0.056609
C  -2.525258 0.507704 0.744883
C  -1.710803 3.112373 1.240324
C  -2.878236 1.140807 1.927697
C  -2.474765 2.440324 2.186834
C  -2.077943 5.336288 1.944082
C  -3.419276 5.414446 1.588408
C  -1.519106 6.284612 2.789747
C  -4.19624 6.446496 2.09158
C  -2.306339 7.31566 3.277408
C  -3.648498 7.399737 2.937065
H  0.99792 -3.849581 -0.861492
H  2.179789 -1.011189 -1.182693
H  4.017168 -1.685848 0.171954
H  3.280649 -1.228699 1.697191
H  3.858029 -2.877309 1.457874
H  1.520373 -3.590245 2.221148
H  0.873479 -1.951308 2.258147
H  0.097888 -3.183269 1.266017
H  3.8178 -2.858185 -1.73094
H  -1.236444 1.243912 -2.275976
H  -2.057642 -0.241073 -1.783509
H  -0.756612 3.030558 -0.666856
H  -2.839138 -0.509999 0.556924
H  -3.472883 0.614443 2.662339
H  -2.75164 2.925328 3.114084
H  -3.855766 4.681993 0.921788
H  -0.472521 6.211417 3.054846
H  -5.239813 6.506104 1.811588
H  -1.865988 8.054212 3.934214
H  -4.261097 8.202887 3.323463
totalener: -1958.42683038 hartree
nucrepener: 2376.63961856 hartree
electener: -4335.06644895 hartree
oneelecener: -7406.36866752 hartree
twoeener: 3071.30221858 hartree
kineticenergy: 1952.61623982 hartree
xcener: -143.512058399283 hartree
chargesum: -0.0000000
charge: -0.041189 -0.049157 -0.262236 -0.396170 -0.300163 0.069023 0.043587 -0.086516 -0.245321 -0.250113 -0.200749 0.366709 0.048317 0.047139 0.000796 -0.215654 -0.132070 0.200299 -0.116660 -0.151039 0.237379 -0.152119 -0.208610 -0.123319 -0.093423 -0.144766 0.086030 0.075935 0.071545 0.094719 0.097363 0.087814 0.087881 0.101860 0.094812 0.103725 0.113554 0.110971 0.131540 0.129333 0.134922 0.131428 0.124724 0.126766 0.125326 0.125775
qa: -0.0412 -0.0492 -0.2622 -0.3962 -0.3002 0.0690 0.0436 -0.0865 -0.2453 -0.2501 -0.2007 0.3667 0.0483 0.0471 0.0008 -0.2157 -0.1321 0.2003 -0.1167 -0.1510 0.2374 -0.1521 -0.2086 -0.1233 -0.0934 -0.1448 0.0860 0.0759 0.0715 0.0947 0.0974 0.0878 0.0879 0.1019 0.0948 0.1037 0.1136 0.1110 0.1315 0.1293 0.1349 0.1314 0.1247 0.1268 0.1253 0.1258
va: 1.2865 1.2557 2.1387 2.1044 2.1009 3.7569 3.8242 3.8684 3.9088 3.9132 3.9158 4.2271 4.2457 3.8527 3.6849 4.0957 3.9420 3.8824 3.9539 3.9543 3.8132 3.9217 4.0290 3.9561 3.9413 3.9597 1.0489 1.0366 1.0103 1.0039 1.0029 1.0012 1.0021 1.0232 1.0313 0.9967 1.0113 1.0235 1.0213 1.0005 1.0021 1.0048 1.0140 1.0001 0.9987 1.0002
dispcorr: -0.021254614 hartree
energy: -1958.448084995486
dipole: -16.87662 16.71089 -0.16573 32.42065 -31.42077 0.99988 25.43669 -24.82327 0.61342
magnitude: 1.18470 au
magnitude: 3.01126 debye
