program: Orca
programVersion: 5.0.3
elementType: Cl Cl O O O C C C C C C C C C C C C C C C C C C C C C H H H H H H H H H H H H H H H H H H H H
charge: 0
multiplicity: 1
keywords: wb97x-d3
keywords: def2-TZVPP
keywords: def2/J RIJCOSX
keywords: DEFGRID2
keywords: scfconv7
keywords: smallprint printgap noloewdin
keywords: NOSOSCF
formula: C21H20Cl2O3
InChI: InChI=1/C21H20Cl2O3/c1-21(2)17(12-18(22)23)19(21)20(24)25-13-14-7-6-10-16(11-14)26-15-8-4-3-5-9-15/h3-12,17,19H,13H2,1-2H3
46 atoms
Cl 2.990298 -4.645286 -3.159785
Cl 5.5511 -3.85558 -2.094201
O  -0.076545 0.279831 -0.832776
O  -0.762144 -1.688585 -1.662662
O  -3.711752 3.731028 1.848331
C  1.172108 -2.78982 0.533916
C  1.799162 -2.894988 -0.826071
C  1.234776 -1.567916 -0.359959
C  2.045436 -2.751607 1.766014
C  -0.131128 -3.515396 0.766118
C  3.247607 -3.03638 -1.013972
C  0.025734 -1.034913 -1.030033
C  3.838903 -3.750807 -1.964062
C  -1.214868 0.967046 -1.363712
C  -2.279446 1.131561 -0.315811
C  -2.462501 2.369497 0.287558
C  -3.081294 0.056481 0.057291
C  -3.436836 2.531546 1.266209
C  -4.045264 0.227273 1.037214
C  -4.225255 1.456872 1.65015
C  -2.732882 4.66125 2.043258
C  -3.057899 5.985009 1.785061
C  -1.478514 4.328106 2.539951
C  -2.124534 6.980264 2.030216
C  -0.550955 5.33259 2.768945
C  -0.866339 6.659929 2.517054
H  1.184535 -3.396383 -1.564551
H  1.948581 -0.811814 -0.052808
H  2.352946 -3.759093 2.05043
H  2.946824 -2.153613 1.637124
H  1.493475 -2.322498 2.60346
H  0.07439 -4.519868 1.13937
H  -0.73216 -2.999982 1.517861
H  -0.730184 -3.612714 -0.135134
H  3.90552 -2.515874 -0.329105
H  -0.841726 1.939774 -1.683789
H  -1.601959 0.443964 -2.238693
H  -1.848643 3.209608 -0.014466
H  -2.958008 -0.904844 -0.422721
H  -4.66979 -0.606803 1.328555
H  -4.980281 1.594573 2.41283
H  -4.040847 6.226963 1.402799
H  -1.227973 3.296585 2.751392
H  -2.384119 8.011988 1.833182
H  0.425122 5.072257 3.15657
H  -0.138396 7.437853 2.702639
totalener: -1958.42670942 hartree
nucrepener: 2403.58353782 hartree
electener: -4362.01024723 hartree
oneelecener: -7460.09383267 hartree
twoeener: 3098.08358544 hartree
kineticenergy: 1952.60963148 hartree
xcener: -143.512392351025 hartree
chargesum: -0.0000000
charge: -0.040260 -0.049372 -0.261371 -0.395369 -0.297115 0.070891 0.040908 -0.081240 -0.251955 -0.255445 -0.204716 0.361822 0.052607 0.047676 0.012676 -0.207647 -0.177917 0.245869 -0.090243 -0.208255 0.262136 -0.215420 -0.184403 -0.087043 -0.107783 -0.148999 0.086455 0.077099 0.098946 0.072517 0.094081 0.089575 0.086854 0.102369 0.094957 0.094160 0.119889 0.120542 0.142982 0.126544 0.125195 0.125574 0.133500 0.125753 0.127133 0.125841
qa: -0.0403 -0.0494 -0.2614 -0.3954 -0.2971 0.0709 0.0409 -0.0812 -0.2520 -0.2554 -0.2047 0.3618 0.0526 0.0477 0.0127 -0.2076 -0.1779 0.2459 -0.0902 -0.2083 0.2621 -0.2154 -0.1844 -0.0870 -0.1078 -0.1490 0.0865 0.0771 0.0989 0.0725 0.0941 0.0896 0.0869 0.1024 0.0950 0.0942 0.1199 0.1205 0.1430 0.1265 0.1252 0.1256 0.1335 0.1258 0.1271 0.1258
va: 1.2872 1.2554 2.1411 2.1029 2.1139 3.7585 3.8227 3.8666 3.9084 3.9128 3.9244 4.2361 4.2492 3.8467 3.7418 3.9889 3.9593 3.8540 3.9448 4.0397 3.7987 4.0444 3.9536 3.9282 3.9388 3.9675 1.0511 1.0355 1.0022 1.0101 1.0038 1.0023 1.0024 1.0214 1.0320 1.0036 1.0110 1.0122 1.0178 1.0004 1.0133 1.0142 1.0041 0.9989 0.9996 1.0005
dispcorr: -0.021412436 hartree
energy: -1958.448121852481
dipole: -22.54136 22.61161 0.07026 20.40226 -19.66243 0.73983 24.35334 -23.42527 0.92806
magnitude: 1.18894 au
magnitude: 3.02205 debye
