program: Orca
programVersion: 5.0.3
elementType: Cl Cl O O O C C C C C C C C C C C C C C C C C C C C C H H H H H H H H H H H H H H H H H H H H
charge: 0
multiplicity: 1
keywords: wb97x-d3
keywords: def2-TZVPP
keywords: def2/J RIJCOSX
keywords: DEFGRID2
keywords: scfconv7
keywords: smallprint printgap noloewdin
keywords: NOSOSCF
formula: C21H20Cl2O3
InChI: InChI=1/C21H20Cl2O3/c1-21(2)17(12-18(22)23)19(21)20(24)25-13-14-7-6-10-16(11-14)26-15-8-4-3-5-9-15/h3-12,17,19H,13H2,1-2H3
46 atoms
Cl 1.82145 0.281907 -2.463856
Cl 4.239365 0.674923 -0.937623
O  -1.65191 -1.993824 1.299951
O  -1.518867 -2.635082 -0.838462
O  -2.279318 3.08832 0.44602
C  1.334737 -3.610777 -0.034934
C  1.422428 -2.254504 -0.663066
C  0.463053 -2.492692 0.494135
C  2.430271 -4.077537 0.895355
C  0.751487 -4.73436 -0.85699
C  2.579827 -1.370475 -0.479186
C  -0.988392 -2.396571 0.212773
C  2.839239 -0.290017 -1.205089
C  -3.041155 -1.712914 1.132931
C  -3.267073 -0.44184 0.363575
C  -2.636066 0.727374 0.774519
C  -4.107412 -0.421863 -0.739587
C  -2.844733 1.906888 0.074364
C  -4.329529 0.767361 -1.417845
C  -3.697596 1.933058 -1.022191
C  -1.036411 3.094592 1.014892
C  -0.864381 3.829703 2.177733
C  0.038704 2.438721 0.426716
C  0.394518 3.913217 2.754287
C  1.289553 2.524804 1.016868
C  1.473708 3.259133 2.180314
H  0.922696 -2.167334 -1.621418
H  0.761121 -2.089501 1.455178
H  3.286574 -4.448571 0.329227
H  2.78523 -3.297492 1.568469
H  2.067908 -4.894965 1.52016
H  0.276766 -5.477966 -0.214259
H  0.013207 -4.395102 -1.578081
H  1.55154 -5.235164 -1.404971
H  3.291924 -1.60525 0.302045
H  -3.55254 -2.550077 0.653487
H  -3.423471 -1.621733 2.15006
H  -1.980285 0.715857 1.636958
H  -4.576061 -1.336622 -1.078044
H  -4.983821 0.782971 -2.279313
H  -3.853736 2.861462 -1.555426
H  -1.713088 4.335896 2.618697
H  -0.092648 1.872495 -0.486825
H  0.526957 4.489536 3.660484
H  2.129786 2.024489 0.554583
H  2.454146 3.324358 2.632359
totalener: -1958.42621580 hartree
nucrepener: 2626.20336267 hartree
electener: -4584.62957847 hartree
oneelecener: -7905.65071861 hartree
twoeener: 3321.02114014 hartree
kineticenergy: 1952.62252158 hartree
xcener: -143.515062184348 hartree
chargesum: 0.0000000
charge: -0.042674 -0.055341 -0.272562 -0.378772 -0.301735 0.084981 0.010397 -0.070804 -0.271646 -0.245599 -0.161377 0.341099 0.028578 0.068354 0.020082 -0.204648 -0.144200 0.227256 -0.086537 -0.209702 0.230901 -0.211896 -0.169225 -0.080310 -0.070740 -0.175819 0.093362 0.083583 0.103252 0.074751 0.094712 0.085692 0.103869 0.085724 0.101311 0.099083 0.111715 0.123096 0.105074 0.123547 0.125648 0.123711 0.128258 0.124027 0.128237 0.123288
qa: -0.0427 -0.0553 -0.2726 -0.3788 -0.3017 0.0850 0.0104 -0.0708 -0.2716 -0.2456 -0.1614 0.3411 0.0286 0.0684 0.0201 -0.2046 -0.1442 0.2273 -0.0865 -0.2097 0.2309 -0.2119 -0.1692 -0.0803 -0.0707 -0.1758 0.0934 0.0836 0.1033 0.0748 0.0947 0.0857 0.1039 0.0857 0.1013 0.0991 0.1117 0.1231 0.1051 0.1235 0.1256 0.1237 0.1283 0.1240 0.1282 0.1233
va: 1.2786 1.2458 2.1233 2.1244 2.1072 3.7989 3.8260 3.8303 3.9151 3.9048 3.8953 4.2406 4.2113 3.8604 3.7134 3.9225 3.9968 3.8358 3.9476 4.0346 3.8735 4.0420 3.9616 3.9149 3.8659 4.0098 1.0452 1.0321 1.0003 1.0070 1.0048 1.0023 1.0240 1.0008 1.0304 1.0112 0.9890 1.0214 1.0151 0.9995 1.0125 1.0136 1.0137 0.9987 1.0159 1.0021
dispcorr: -0.025176085 hartree
energy: -1958.451391883110
dipole: -11.32205 11.55099 0.22894 -18.76045 17.91726 -0.84320 13.38327 -12.55333 0.82994
magnitude: 1.20507 au
magnitude: 3.06304 debye
