program: Orca
programVersion: 5.0.3
elementType: Cl Cl O O O C C C C C C C C C C C C C C C C C C C C C H H H H H H H H H H H H H H H H H H H H
charge: 0
multiplicity: 1
keywords: wb97x-d3
keywords: def2-TZVPP
keywords: def2/J RIJCOSX
keywords: DEFGRID2
keywords: scfconv7
keywords: smallprint printgap noloewdin
keywords: NOSOSCF
formula: C21H20Cl2O3
InChI: InChI=1/C21H20Cl2O3/c1-21(2)17(12-18(22)23)19(21)20(24)25-13-14-7-6-10-16(11-14)26-15-8-4-3-5-9-15/h3-12,17,19H,13H2,1-2H3
46 atoms
Cl 4.98003 -1.966215 -0.877021
Cl 5.137233 -4.803373 -0.380139
O  -1.027366 -1.550004 1.279763
O  0.417237 -0.129222 0.331222
O  -2.910554 3.646661 -0.482963
C  0.644311 -2.535255 -1.705657
C  1.870279 -2.414328 -0.845245
C  0.504033 -2.460787 -0.199722
C  0.301817 -3.861883 -2.341359
C  0.27402 -1.354249 -2.569318
C  2.801112 -3.530518 -0.641723
C  -0.007924 -1.243966 0.472732
C  4.125267 -3.436049 -0.635629
C  -1.683865 -0.459591 1.925682
C  -2.565564 0.303166 0.977531
C  -2.305436 1.637356 0.703806
C  -3.641998 -0.331445 0.365085
C  -3.137218 2.343845 -0.156822
C  -4.450975 0.374109 -0.509754
C  -4.210508 1.714618 -0.769273
C  -2.41119 4.503385 0.455789
C  -1.395834 5.363425 0.066001
C  -2.929312 4.56118 1.744122
C  -0.899549 6.289123 0.971556
C  -2.416869 5.48377 2.641967
C  -1.402096 6.350778 2.262303
H  2.323185 -1.429659 -0.848405
H  0.216484 -3.390508 0.279134
H  0.478047 -4.712845 -1.68407
H  -0.752565 -3.883513 -2.620684
H  0.889295 -4.016455 -3.247739
H  0.757628 -1.447698 -3.542999
H  -0.804185 -1.31996 -2.735858
H  0.57477 -0.402974 -2.138191
H  2.389248 -4.518152 -0.474087
H  -2.279478 -0.926577 2.710428
H  -0.957629 0.202404 2.401213
H  -1.443969 2.118115 1.149871
H  -3.846648 -1.374502 0.571535
H  -5.288369 -0.117294 -0.987109
H  -4.844967 2.274625 -1.443462
H  -1.003234 5.304318 -0.940445
H  -3.728105 3.894694 2.043039
H  -0.108453 6.960492 0.664996
H  -2.821503 5.527709 3.644561
H  -1.008192 7.070223 2.96722
totalener: -1958.42641770 hartree
nucrepener: 2443.08165146 hartree
electener: -4401.50806916 hartree
oneelecener: -7539.49387800 hartree
twoeener: 3137.98580884 hartree
kineticenergy: 1952.63211620 hartree
xcener: -143.515307193211 hartree
chargesum: 0.0000000
charge: -0.040985 -0.050040 -0.266689 -0.381061 -0.299851 0.066312 0.045620 -0.085779 -0.246216 -0.244999 -0.206212 0.353528 0.051732 0.050837 -0.009391 -0.094009 -0.216375 0.209937 -0.079847 -0.212260 0.234715 -0.199341 -0.157716 -0.093038 -0.117036 -0.142111 0.085088 0.076365 0.071178 0.092659 0.098830 0.088072 0.087122 0.102094 0.096212 0.114921 0.104006 0.118617 0.113749 0.124494 0.125906 0.124921 0.129691 0.125052 0.126236 0.125061
qa: -0.0410 -0.0500 -0.2667 -0.3811 -0.2999 0.0663 0.0456 -0.0858 -0.2462 -0.2450 -0.2062 0.3535 0.0517 0.0508 -0.0094 -0.0940 -0.2164 0.2099 -0.0798 -0.2123 0.2347 -0.1993 -0.1577 -0.0930 -0.1170 -0.1421 0.0851 0.0764 0.0712 0.0927 0.0988 0.0881 0.0871 0.1021 0.0962 0.1149 0.1040 0.1186 0.1137 0.1245 0.1259 0.1249 0.1297 0.1251 0.1262 0.1251
va: 1.2864 1.2553 2.1311 2.1248 2.1078 3.7692 3.8208 3.8464 3.9064 3.9142 3.9238 4.2582 4.2463 3.8681 3.6815 3.8681 4.0093 3.8538 3.9256 4.0441 3.8262 4.0398 3.9450 3.9338 3.9471 3.9603 1.0526 1.0354 1.0098 1.0044 1.0028 1.0012 1.0027 1.0220 1.0302 0.9902 1.0104 1.0241 1.0150 0.9988 1.0125 1.0136 1.0048 0.9990 0.9999 1.0004
dispcorr: -0.021954052 hartree
energy: -1958.448371748941
dipole: -33.79959 32.74797 -1.05162 14.35889 -14.73561 -0.37672 -2.09159 2.30895 0.21736
magnitude: 1.13801 au
magnitude: 2.89260 debye
