program: Orca
programVersion: 5.0.3
elementType: Cl Cl O O O C C C C C C C C C C C C C C C C C C C C C H H H H H H H H H H H H H H H H H H H H
charge: 0
multiplicity: 1
keywords: wb97x-d3
keywords: def2-TZVPP
keywords: def2/J RIJCOSX
keywords: DEFGRID2
keywords: scfconv7
keywords: smallprint printgap noloewdin
keywords: NOSOSCF
formula: C21H20Cl2O3
InChI: InChI=1/C21H20Cl2O3/c1-21(2)17(12-18(22)23)19(21)20(24)25-13-14-7-6-10-16(11-14)26-15-8-4-3-5-9-15/h3-12,17,19H,13H2,1-2H3
46 atoms
Cl 2.059382 -5.728493 -1.69951
Cl 4.609643 -4.87084 -2.739191
O  -0.563466 -0.261327 -1.687995
O  -1.022308 -2.092973 -0.481567
O  -2.351247 4.322938 0.424914
C  1.942026 -1.69529 0.456351
C  1.862036 -2.79577 -0.560526
C  1.246637 -1.442913 -0.864861
C  3.239368 -0.95089 0.669854
C  1.146564 -1.856153 1.729663
C  3.027479 -3.240857 -1.333229
C  -0.226801 -1.33335 -0.968105
C  3.198801 -4.452698 -1.847457
C  -1.95563 0.047178 -1.810097
C  -2.434006 0.856102 -0.638359
C  -2.167735 2.219882 -0.596084
C  -3.110649 0.257026 0.417548
C  -2.588573 2.982044 0.482715
C  -3.525408 1.026195 1.494237
C  -3.27317 2.387685 1.536552
C  -2.069049 5.013386 1.568363
C  -2.698894 6.235101 1.752718
C  -1.145732 4.549159 2.497317
C  -2.399911 6.997099 2.872017
C  -0.862895 5.316855 3.615892
C  -1.48691 6.540707 3.810323
H  1.134364 -3.566261 -0.332658
H  1.790384 -0.806009 -1.553238
H  3.777279 -0.744609 -0.254957
H  3.043186 0.011185 1.144982
H  3.905404 -1.515197 1.324661
H  1.763029 -2.34694 2.484525
H  0.84945 -0.883446 2.125583
H  0.247174 -2.450794 1.595731
H  3.823208 -2.529367 -1.515297
H  -2.032504 0.622608 -2.732273
H  -2.544022 -0.863711 -1.926031
H  -1.638101 2.703487 -1.408366
H  -3.306786 -0.806218 0.398896
H  -4.05999 0.562079 2.312437
H  -3.614153 2.979433 2.37609
H  -3.413405 6.582326 1.018119
H  -0.648885 3.599176 2.347122
H  -2.891944 7.950394 3.012682
H  -0.1422 4.9559 4.33777
H  -1.259387 7.135954 4.684115
totalener: -1958.42692814 hartree
nucrepener: 2409.78841058 hartree
electener: -4368.21533873 hartree
oneelecener: -7472.65600767 hartree
twoeener: 3104.44066895 hartree
kineticenergy: 1952.61883703 hartree
xcener: -143.512883049342 hartree
chargesum: -0.0000000
charge: -0.039942 -0.049665 -0.262345 -0.393195 -0.299115 0.070176 0.028789 -0.074390 -0.259112 -0.248937 -0.194869 0.363988 0.048287 0.048709 -0.006520 -0.222156 -0.124646 0.214141 -0.124401 -0.149425 0.229420 -0.201245 -0.154998 -0.095637 -0.117251 -0.140688 0.086060 0.078427 0.074732 0.093039 0.099537 0.088455 0.086538 0.102026 0.094963 0.107034 0.111474 0.110584 0.125431 0.127745 0.133712 0.125461 0.132197 0.125892 0.126102 0.125618
qa: -0.0399 -0.0497 -0.2623 -0.3932 -0.2991 0.0702 0.0288 -0.0744 -0.2591 -0.2489 -0.1949 0.3640 0.0483 0.0487 -0.0065 -0.2222 -0.1246 0.2141 -0.1244 -0.1494 0.2294 -0.2012 -0.1550 -0.0956 -0.1173 -0.1407 0.0861 0.0784 0.0747 0.0930 0.0995 0.0885 0.0865 0.1020 0.0950 0.1070 0.1115 0.1106 0.1254 0.1277 0.1337 0.1255 0.1322 0.1259 0.1261 0.1256
va: 1.2878 1.2551 2.1378 2.1090 2.1016 3.7714 3.8360 3.8406 3.9101 3.9131 3.9172 4.2365 4.2554 3.8547 3.6945 4.0787 3.9435 3.8713 3.9684 3.9295 3.8210 4.0338 3.9425 3.9349 3.9484 3.9573 1.0503 1.0347 1.0099 1.0042 1.0017 1.0010 1.0023 1.0233 1.0331 0.9962 1.0100 1.0247 1.0224 1.0010 1.0034 1.0135 1.0037 0.9988 1.0000 1.0003
dispcorr: -0.021461934 hartree
energy: -1958.448390078363
dipole: -13.76640 13.84526 0.07886 33.70897 -32.61661 1.09236 23.92710 -23.25542 0.67168
magnitude: 1.28477 au
magnitude: 3.26562 debye
