program: Orca
programVersion: 5.0.3
elementType: Cl Cl O O O C C C C C C C C C C C C C C C C C C C C C H H H H H H H H H H H H H H H H H H H H
charge: 0
multiplicity: 1
keywords: wb97x-d3
keywords: def2-TZVPP
keywords: def2/J RIJCOSX
keywords: DEFGRID2
keywords: scfconv7
keywords: smallprint printgap noloewdin
keywords: NOSOSCF
formula: C21H20Cl2O3
InChI: InChI=1/C21H20Cl2O3/c1-21(2)17(12-18(22)23)19(21)20(24)25-13-14-7-6-10-16(11-14)26-15-8-4-3-5-9-15/h3-12,17,19H,13H2,1-2H3
46 atoms
Cl 2.266505 -3.020663 -2.857419
Cl 4.991179 -3.481298 -2.023153
O  -0.74602 -0.27965 -1.651238
O  -1.198854 -2.055229 -0.368229
O  -2.779994 3.552823 1.165305
C  1.482105 -1.178079 1.008533
C  1.709811 -2.370755 0.137173
C  1.019411 -1.162284 -0.438979
C  2.648032 -0.268998 1.317809
C  0.489977 -1.281667 2.139643
C  3.0685 -2.74365 -0.314783
C  -0.415818 -1.246037 -0.788059
C  3.394414 -3.040235 -1.56565
C  -2.128088 -0.151701 -1.971699
C  -2.898578 0.508407 -0.862198
C  -2.451197 1.716298 -0.339833
C  -4.067404 -0.059105 -0.372374
C  -3.174227 2.344747 0.663124
C  -4.794115 0.586986 0.615879
C  -4.349481 1.788273 1.144501
C  -1.528826 3.68449 1.687765
C  -0.857532 2.637135 2.307606
C  -0.951171 4.94587 1.621477
C  0.396066 2.863645 2.856258
C  0.2998 5.156991 2.177666
C  0.983135 4.118209 2.793543
H  1.048082 -3.212941 0.325944
H  1.605609 -0.530781 -1.096494
H  3.19161 -0.621725 2.19681
H  3.357542 -0.20395 0.492527
H  2.295274 0.741969 1.528796
H  0.066759 -0.302333 2.371061
H  -0.333783 -1.957673 1.925942
H  0.994895 -1.641942 3.037982
H  3.855122 -2.805366 0.428637
H  -2.146638 0.46701 -2.869651
H  -2.564106 -1.121022 -2.220668
H  -1.540435 2.171064 -0.711996
H  -4.405789 -1.011381 -0.759671
H  -5.705382 0.142452 0.993178
H  -4.903516 2.295714 1.923117
H  -1.308678 1.655313 2.372027
H  -1.488141 5.752136 1.139358
H  0.91186 2.047753 3.346717
H  0.744227 6.142019 2.123518
H  1.960425 4.286723 3.2248
totalener: -1958.42432942 hartree
nucrepener: 2560.64895009 hartree
electener: -4519.07327951 hartree
oneelecener: -7774.35107056 hartree
twoeener: 3255.27779105 hartree
kineticenergy: 1952.62820557 hartree
xcener: -143.514973919161 hartree
chargesum: -0.0000000
charge: -0.032840 -0.044120 -0.267213 -0.378246 -0.301239 0.138628 -0.011371 -0.152680 -0.280805 -0.246487 -0.249715 0.362640 0.092114 0.065206 0.021680 -0.199934 -0.134020 0.205005 -0.096273 -0.190895 0.231148 -0.128754 -0.207902 -0.157326 -0.088342 -0.149932 0.105882 0.101718 0.093225 0.088621 0.093656 0.054330 0.108528 0.090685 0.117107 0.111318 0.102496 0.125369 0.109170 0.125670 0.127129 0.139208 0.124463 0.133996 0.124479 0.124624
qa: -0.0328 -0.0441 -0.2672 -0.3782 -0.3012 0.1386 -0.0114 -0.1527 -0.2808 -0.2465 -0.2497 0.3626 0.0921 0.0652 0.0217 -0.1999 -0.1340 0.2050 -0.0963 -0.1909 0.2311 -0.1288 -0.2079 -0.1573 -0.0883 -0.1499 0.1059 0.1017 0.0932 0.0886 0.0937 0.0543 0.1085 0.0907 0.1171 0.1113 0.1025 0.1254 0.1092 0.1257 0.1271 0.1392 0.1245 0.1340 0.1245 0.1246
va: 1.2982 1.2615 2.1204 2.1251 2.1014 3.6834 3.8411 3.8715 3.9178 3.8950 3.9089 4.1974 4.2034 3.8588 3.6877 3.9629 3.9910 3.8389 3.9382 4.0373 3.8533 3.8750 4.0282 3.9457 3.9507 3.9833 1.0286 1.0261 0.9995 1.0031 1.0125 1.0172 1.0253 1.0033 1.0175 0.9897 1.0120 1.0209 1.0140 0.9998 1.0108 0.9986 1.0142 0.9927 0.9982 1.0015
dispcorr: -0.025330350 hartree
energy: -1958.449659775002
dipole: -15.21170 15.37029 0.15858 20.12429 -19.70383 0.42046 25.12087 -24.69861 0.42226
magnitude: 0.61664 au
magnitude: 1.56736 debye
