program: Orca
programVersion: 5.0.3
elementType: Cl Cl O O O C C C C C C C C C C C C C C C C C C C C C H H H H H H H H H H H H H H H H H H H H
charge: 0
multiplicity: 1
keywords: wb97x-d3
keywords: def2-TZVPP
keywords: def2/J RIJCOSX
keywords: DEFGRID2
keywords: scfconv7
keywords: smallprint printgap noloewdin
keywords: NOSOSCF
formula: C21H20Cl2O3
InChI: InChI=1/C21H20Cl2O3/c1-21(2)17(12-18(22)23)19(21)20(24)25-13-14-7-6-10-16(11-14)26-15-8-4-3-5-9-15/h3-12,17,19H,13H2,1-2H3
46 atoms
Cl 0.669617 -0.416118 1.403863
Cl 3.060337 -1.039556 2.904569
O  -1.900262 -2.604321 -0.597949
O  -0.705276 -1.676182 -2.248395
O  -1.994878 2.9978 -1.137349
C  1.529573 -3.69485 -1.338742
C  1.71883 -2.360001 -0.703287
C  0.370998 -3.044898 -0.609572
C  2.111166 -4.909607 -0.655112
C  1.537918 -3.791378 -2.844559
C  2.510428 -2.14925 0.527643
C  -0.768888 -2.372933 -1.27007
C  2.134114 -1.30938 1.483679
C  -3.013047 -1.754587 -0.888418
C  -2.813841 -0.419348 -0.228646
C  -2.498476 0.704071 -0.98075
C  -2.862758 -0.324647 1.15863
C  -2.249193 1.91398 -0.34974
C  -2.606094 0.885592 1.781659
C  -2.298633 2.012269 1.034499
C  -0.945134 3.815958 -0.836201
C  0.268629 3.326335 -0.368446
C  -1.115631 5.17421 -1.064435
C  1.309393 4.210711 -0.13069
C  -0.063108 6.044853 -0.828999
C  1.152311 5.569952 -0.359034
H  1.728966 -1.520621 -1.394624
H  0.129652 -3.486946 0.350227
H  3.154356 -5.052543 -0.943983
H  2.074084 -4.836807 0.43253
H  1.56358 -5.808237 -0.942844
H  1.156801 -2.894333 -3.325657
H  2.557481 -3.957136 -3.197634
H  0.932055 -4.6353 -3.179252
H  3.450802 -2.672839 0.654227
H  -3.163169 -1.65366 -1.964112
H  -3.875678 -2.272473 -0.469678
H  -2.4277 0.642032 -2.05895
H  -3.094999 -1.199249 1.753541
H  -2.649131 0.958827 2.860318
H  -2.102625 2.957685 1.523976
H  0.407365 2.266432 -0.196807
H  -2.067028 5.537753 -1.430031
H  2.25444 3.827015 0.230299
H  -0.199031 7.102973 -1.010129
H  1.970323 6.252642 -0.173692
totalener: -1958.42363050 hartree
nucrepener: 2632.49063935 hartree
electener: -4590.91426985 hartree
oneelecener: -7918.50456689 hartree
twoeener: 3327.59029704 hartree
kineticenergy: 1952.63048097 hartree
xcener: -143.515298203758 hartree
chargesum: 0.0000000
charge: -0.037188 -0.045964 -0.261336 -0.391175 -0.300413 0.128395 -0.040695 -0.114258 -0.271867 -0.251621 -0.245531 0.345450 0.107941 0.056311 0.001975 -0.125472 -0.200977 0.179606 -0.128294 -0.130614 0.208125 -0.110251 -0.189953 -0.141558 -0.103785 -0.132347 0.111298 0.098472 0.093556 0.084908 0.094854 0.103915 0.083191 0.086045 0.119691 0.105715 0.111688 0.117530 0.110255 0.126967 0.132799 0.119374 0.123489 0.124813 0.123331 0.123608
qa: -0.0372 -0.0460 -0.2613 -0.3912 -0.3004 0.1284 -0.0407 -0.1143 -0.2719 -0.2516 -0.2455 0.3454 0.1079 0.0563 0.0020 -0.1255 -0.2010 0.1796 -0.1283 -0.1306 0.2081 -0.1103 -0.1900 -0.1416 -0.1038 -0.1323 0.1113 0.0985 0.0936 0.0849 0.0949 0.1039 0.0832 0.0860 0.1197 0.1057 0.1117 0.1175 0.1103 0.1270 0.1328 0.1194 0.1235 0.1248 0.1233 0.1236
va: 1.3195 1.2612 2.1220 2.1024 2.0996 3.7218 3.8594 3.8424 3.9100 3.8961 3.9105 4.2201 4.1782 3.8524 3.6457 4.0057 3.9736 3.8937 3.9024 3.9344 3.8256 3.8940 4.0155 3.9720 3.9489 3.9447 1.0281 1.0272 1.0009 1.0009 1.0065 1.0223 1.0022 1.0022 1.0152 1.0125 0.9926 1.0307 1.0167 1.0018 1.0032 1.0197 1.0141 1.0011 0.9991 1.0003
dispcorr: -0.025833993 hartree
energy: -1958.449464493127
dipole: -2.61386 2.86677 0.25291 -8.18351 7.44752 -0.73599 -17.00428 17.36135 0.35707
magnitude: 0.85623 au
magnitude: 2.17637 debye
