program: Orca
programVersion: 5.0.3
elementType: Cl Cl O O O C C C C C C C C C C C C C C C C C C C C C H H H H H H H H H H H H H H H H H H H H
charge: 0
multiplicity: 1
keywords: wb97x-d3
keywords: def2-TZVPP
keywords: def2/J RIJCOSX
keywords: DEFGRID2
keywords: scfconv7
keywords: smallprint printgap noloewdin
keywords: NOSOSCF
formula: C21H20Cl2O3
InChI: InChI=1/C21H20Cl2O3/c1-21(2)17(12-18(22)23)19(21)20(24)25-13-14-7-6-10-16(11-14)26-15-8-4-3-5-9-15/h3-12,17,19H,13H2,1-2H3
46 atoms
Cl 1.226568 -0.991881 1.725971
Cl 3.536751 -2.24035 2.940977
O  -1.786823 -2.465481 -0.547156
O  -0.494796 -1.410235 -2.038049
O  -2.430764 3.299629 -0.945232
C  1.428337 -3.857161 -1.554308
C  1.854975 -2.682695 -0.74056
C  0.418805 -3.149984 -0.670046
C  1.824977 -5.239178 -1.092713
C  1.374187 -3.719071 -3.055614
C  2.718117 -2.809593 0.453775
C  -0.632423 -2.245505 -1.184727
C  2.522195 -2.10667 1.561693
C  -2.840655 -1.53706 -0.79063
C  -2.57994 -0.224798 -0.105858
C  -2.583287 0.957664 -0.829885
C  -2.316288 -0.192627 1.260064
C  -2.352727 2.166641 -0.190386
C  -2.072475 1.01759 1.888294
C  -2.093424 2.205242 1.172928
C  -1.484262 4.271707 -0.803231
C  -0.138958 3.975937 -0.618026
C  -1.908479 5.589142 -0.903512
C  0.776619 5.012667 -0.528207
C  -0.979839 6.614681 -0.820532
C  0.364394 6.333629 -0.627016
H  1.984977 -1.75839 -1.298279
H  0.137619 -3.6928 0.225046
H  1.131313 -5.985754 -1.482307
H  2.822553 -5.495804 -1.45522
H  1.831329 -5.33261 -0.00611
H  0.638319 -4.403817 -3.480314
H  1.120796 -2.712773 -3.378174
H  2.345688 -3.973943 -3.482487
H  3.565819 -3.484335 0.426323
H  -2.999198 -1.394997 -1.861379
H  -3.72917 -2.01643 -0.378432
H  -2.754099 0.94748 -1.898967
H  -2.298073 -1.110859 1.833188
H  -1.872199 1.042444 2.951371
H  -1.91127 3.148641 1.671265
H  0.193385 2.947862 -0.551335
H  -2.959402 5.801101 -1.049954
H  1.823803 4.780805 -0.385898
H  -1.313783 7.640827 -0.900217
H  1.08543 7.136589 -0.557649
totalener: -1958.42432871 hartree
nucrepener: 2554.81972449 hartree
electener: -4513.24405319 hartree
oneelecener: -7763.15317001 hartree
twoeener: 3249.90911682 hartree
kineticenergy: 1952.63443834 hartree
xcener: -143.515478372464 hartree
chargesum: -0.0000000
charge: -0.035672 -0.044939 -0.265176 -0.383762 -0.300787 0.122144 -0.029448 -0.124682 -0.271752 -0.251435 -0.249491 0.346156 0.101333 0.065574 0.057817 -0.153868 -0.272302 0.193455 -0.088338 -0.150231 0.225776 -0.143809 -0.206602 -0.121068 -0.094251 -0.143849 0.112188 0.098552 0.094192 0.093473 0.085474 0.085906 0.103433 0.084220 0.117963 0.100636 0.111676 0.108405 0.123451 0.132160 0.133854 0.135181 0.123949 0.126447 0.124012 0.124035
qa: -0.0357 -0.0449 -0.2652 -0.3838 -0.3008 0.1221 -0.0294 -0.1247 -0.2718 -0.2514 -0.2495 0.3462 0.1013 0.0656 0.0578 -0.1539 -0.2723 0.1935 -0.0883 -0.1502 0.2258 -0.1438 -0.2066 -0.1211 -0.0943 -0.1438 0.1122 0.0986 0.0942 0.0935 0.0855 0.0859 0.1034 0.0842 0.1180 0.1006 0.1117 0.1084 0.1235 0.1322 0.1339 0.1352 0.1239 0.1264 0.1240 0.1240
va: 1.3116 1.2616 2.1196 2.1167 2.0993 3.7279 3.8471 3.8499 3.9121 3.8988 3.9184 4.2102 4.1981 3.8530 3.6285 4.0547 3.9694 3.8916 3.8777 3.9566 3.8256 3.9209 4.0316 3.9485 3.9396 3.9564 1.0262 1.0266 1.0067 1.0010 1.0009 1.0023 1.0228 1.0021 1.0162 1.0120 0.9892 1.0264 1.0200 0.9981 1.0022 1.0067 1.0141 1.0002 0.9988 1.0005
dispcorr: -0.024105069 hartree
energy: -1958.448433775009
dipole: -7.04576 7.22573 0.17997 -2.80461 2.07698 -0.72763 -20.26184 20.36086 0.09902
magnitude: 0.75607 au
magnitude: 1.92178 debye
