program: Orca
programVersion: 5.0.3
elementType: Cl Cl O O O C C C C C C C C C C C C C C C C C C C C C H H H H H H H H H H H H H H H H H H H H
charge: 0
multiplicity: 1
keywords: wb97x-d3
keywords: def2-TZVPP
keywords: def2/J RIJCOSX
keywords: DEFGRID2
keywords: scfconv7
keywords: smallprint printgap noloewdin
keywords: NOSOSCF
formula: C21H20Cl2O3
InChI: InChI=1/C21H20Cl2O3/c1-21(2)17(12-18(22)23)19(21)20(24)25-13-14-7-6-10-16(11-14)26-15-8-4-3-5-9-15/h3-12,17,19H,13H2,1-2H3
46 atoms
Cl 3.094493 -2.630394 -3.672241
Cl 5.383595 -2.108521 -1.997795
O  -0.995603 -1.873749 1.159342
O  -1.21823 -2.567413 -0.960356
O  -1.584718 3.414039 2.246951
C  1.139678 -4.45944 -0.114771
C  1.632152 -3.330497 -0.97465
C  0.789981 -3.031647 0.24793
C  2.098327 -5.164852 0.815274
C  0.097682 -5.385575 -0.694736
C  3.039493 -2.913321 -0.994492
C  -0.571562 -2.480395 0.050687
C  3.736229 -2.596897 -2.079435
C  -2.279553 -1.239404 1.131115
C  -2.16498 0.192117 0.692224
C  -1.964207 1.184258 1.643177
C  -2.24013 0.537831 -0.653193
C  -1.827785 2.509924 1.257705
C  -2.098125 1.863904 -1.029844
C  -1.88715 2.85699 -0.086155
C  -2.063249 4.688406 2.152491
C  -3.36098 4.963577 1.737981
C  -1.218328 5.715104 2.547682
C  -3.802699 6.277071 1.71679
C  -1.677406 7.023142 2.532275
C  -2.967027 7.311594 2.112517
H  1.101907 -3.219324 -1.913331
H  1.309062 -2.637705 1.114672
H  1.54772 -5.67717 1.605623
H  2.67659 -5.914392 0.272553
H  2.803664 -4.490708 1.299786
H  -0.56051 -4.892176 -1.404744
H  0.589174 -6.210693 -1.212583
H  -0.520046 -5.814556 0.096691
H  3.566087 -2.845934 -0.050558
H  -2.967335 -1.794383 0.49221
H  -2.643199 -1.2974 2.156795
H  -1.909455 0.934688 2.696162
H  -2.398714 -0.227271 -1.400576
H  -2.146556 2.132902 -2.07667
H  -1.769747 3.886796 -0.397254
H  -4.023006 4.161499 1.437944
H  -0.211828 5.482529 2.869642
H  -4.813242 6.490049 1.393908
H  -1.017128 7.821412 2.844366
H  -3.319801 8.333768 2.096013
totalener: -1958.42688933 hartree
nucrepener: 2392.25392801 hartree
electener: -4350.68081734 hartree
oneelecener: -7437.74448723 hartree
twoeener: 3087.06366988 hartree
kineticenergy: 1952.61795279 hartree
xcener: -143.512899078217 hartree
chargesum: 0.0000000
charge: -0.041857 -0.049086 -0.261006 -0.401565 -0.298964 0.064192 0.045295 -0.085114 -0.243068 -0.250072 -0.202419 0.367965 0.051103 0.049678 0.007177 -0.234792 -0.140013 0.232288 -0.114494 -0.168161 0.246475 -0.169795 -0.207193 -0.114756 -0.092445 -0.143852 0.084812 0.076585 0.092175 0.098260 0.072001 0.103646 0.087543 0.085290 0.095495 0.113424 0.102496 0.109159 0.134699 0.128779 0.133634 0.133314 0.124957 0.127033 0.125617 0.125559
qa: -0.0419 -0.0491 -0.2610 -0.4016 -0.2990 0.0642 0.0453 -0.0851 -0.2431 -0.2501 -0.2024 0.3680 0.0511 0.0497 0.0072 -0.2348 -0.1400 0.2323 -0.1145 -0.1682 0.2465 -0.1698 -0.2072 -0.1148 -0.0924 -0.1439 0.0848 0.0766 0.0922 0.0983 0.0720 0.1036 0.0875 0.0853 0.0955 0.1134 0.1025 0.1092 0.1347 0.1288 0.1336 0.1333 0.1250 0.1270 0.1256 0.1256
va: 1.2854 1.2561 2.1399 2.0956 2.1065 3.7597 3.8175 3.8600 3.9101 3.9115 3.9229 4.2302 4.2441 3.8387 3.7020 4.1071 3.9519 3.8625 3.9653 3.9476 3.8057 3.9475 4.0381 3.9457 3.9339 3.9611 1.0525 1.0359 1.0043 1.0029 1.0102 1.0224 1.0019 1.0018 1.0305 1.0132 0.9984 1.0245 1.0206 1.0010 1.0035 1.0034 1.0141 0.9998 0.9989 1.0004
dispcorr: -0.020977906 hartree
energy: -1958.447867240644
dipole: -25.79752 25.33461 -0.46290 1.57741 -1.55278 0.02464 19.06147 -18.27899 0.78248
magnitude: 0.90948 au
magnitude: 2.31172 debye
