program: Orca
programVersion: 5.0.3
elementType: Cl Cl O O O C C C C C C C C C C C C C C C C C C C C C H H H H H H H H H H H H H H H H H H H H
charge: 0
multiplicity: 1
keywords: wb97x-d3
keywords: def2-TZVPP
keywords: def2/J RIJCOSX
keywords: DEFGRID2
keywords: scfconv7
keywords: smallprint printgap noloewdin
keywords: NOSOSCF
formula: C21H20Cl2O3
InChI: InChI=1/C21H20Cl2O3/c1-21(2)17(12-18(22)23)19(21)20(24)25-13-14-7-6-10-16(11-14)26-15-8-4-3-5-9-15/h3-12,17,19H,13H2,1-2H3
46 atoms
Cl 3.847523 -2.881596 -3.145766
Cl 5.709701 -2.322112 -1.013446
O  -1.240635 -1.83122 0.843072
O  -1.022842 -2.273074 -1.342783
O  -1.655054 3.361559 2.214428
C  1.030804 -4.376319 -0.216542
C  1.734987 -3.211944 -0.853427
C  0.673193 -2.962544 0.193278
C  1.75194 -5.207002 0.817522
C  0.097279 -5.190977 -1.077739
C  3.135718 -2.884133 -0.551653
C  -0.602178 -2.327874 -0.21724
C  4.095624 -2.720234 -1.453969
C  -2.473399 -1.138046 0.620802
C  -2.236892 0.316026 0.328551
C  -2.083796 1.209062 1.382893
C  -2.157438 0.780972 -0.979115
C  -1.843874 2.551442 1.134201
C  -1.916735 2.12543 -1.219027
C  -1.754256 3.017767 -0.171915
C  -2.173679 4.623741 2.218569
C  -1.402246 5.626453 2.788488
C  -3.443416 4.905828 1.728441
C  -1.905849 6.915488 2.869885
C  -3.929924 6.201282 1.807811
C  -3.167738 7.211376 2.376561
H  1.41799 -3.000131 -1.868385
H  1.017547 -2.671926 1.179921
H  2.376568 -4.614192 1.484801
H  1.033972 -5.745739 1.437752
H  2.39419 -5.944737 0.333978
H  -0.37253 -4.607015 -1.864801
H  0.65277 -6.002393 -1.550786
H  -0.692894 -5.640584 -0.473245
H  3.422769 -2.758239 0.485174
H  -3.042124 -1.612852 -0.179482
H  -3.029087 -1.256018 1.550797
H  -2.149168 0.867337 2.40907
H  -2.271537 0.091935 -1.804658
H  -1.847274 2.485823 -2.23675
H  -1.559343 4.06367 -0.370839
H  -0.416655 5.389909 3.167348
H  -4.050078 4.123367 1.291179
H  -1.301497 7.69416 3.31607
H  -4.918677 6.418538 1.425645
H  -3.555078 8.219283 2.436402
totalener: -1958.42665782 hartree
nucrepener: 2389.79779245 hartree
electener: -4348.22445027 hartree
oneelecener: -7432.82684150 hartree
twoeener: 3084.60239123 hartree
kineticenergy: 1952.61447997 hartree
xcener: -143.511422627859 hartree
chargesum: -0.0000000
charge: -0.041743 -0.047783 -0.261114 -0.398110 -0.300234 0.072026 0.039970 -0.100446 -0.235699 -0.252785 -0.197999 0.368120 0.045666 0.046822 -0.000595 -0.223533 -0.125309 0.210994 -0.119126 -0.153024 0.236896 -0.206202 -0.157444 -0.094333 -0.119643 -0.142998 0.088528 0.076198 0.070272 0.092984 0.097822 0.102626 0.088068 0.086213 0.099297 0.111426 0.105978 0.110329 0.129759 0.128792 0.133788 0.125316 0.132402 0.125590 0.126774 0.125464
qa: -0.0417 -0.0478 -0.2611 -0.3981 -0.3002 0.0720 0.0400 -0.1004 -0.2357 -0.2528 -0.1980 0.3681 0.0457 0.0468 -0.0006 -0.2235 -0.1253 0.2110 -0.1191 -0.1530 0.2369 -0.2062 -0.1574 -0.0943 -0.1196 -0.1430 0.0885 0.0762 0.0703 0.0930 0.0978 0.1026 0.0881 0.0862 0.0993 0.1114 0.1060 0.1103 0.1298 0.1288 0.1338 0.1253 0.1324 0.1256 0.1268 0.1255
va: 1.2855 1.2579 2.1381 2.1011 2.1026 3.7546 3.8105 3.8792 3.9066 3.9122 3.9068 4.2327 4.2398 3.8452 3.6878 4.0963 3.9480 3.8740 3.9652 3.9456 3.8151 4.0324 3.9330 3.9374 3.9513 3.9592 1.0491 1.0371 1.0097 1.0044 1.0036 1.0221 1.0022 1.0017 1.0267 1.0126 0.9970 1.0241 1.0215 1.0009 1.0027 1.0138 1.0040 0.9988 1.0000 1.0004
dispcorr: -0.021118506 hartree
energy: -1958.447776326602
dipole: -30.21702 29.52951 -0.68750 3.37597 -3.36912 0.00685 13.96697 -13.29350 0.67348
magnitude: 0.96243 au
magnitude: 2.44631 debye
