program: Orca
programVersion: 5.0.3
elementType: Cl Cl O O O C C C C C C C C C C C C C C C C C C C C C H H H H H H H H H H H H H H H H H H H H
charge: 0
multiplicity: 1
keywords: wb97x-d3
keywords: def2-TZVPP
keywords: def2/J RIJCOSX
keywords: DEFGRID2
keywords: scfconv7
keywords: smallprint printgap noloewdin
keywords: NOSOSCF
formula: C21H20Cl2O3
InChI: InChI=1/C21H20Cl2O3/c1-21(2)17(12-18(22)23)19(21)20(24)25-13-14-7-6-10-16(11-14)26-15-8-4-3-5-9-15/h3-12,17,19H,13H2,1-2H3
46 atoms
Cl 1.316977 0.379964 1.847237
Cl 4.168281 0.608563 1.460471
O  -1.424124 -1.95745 0.061903
O  -1.1276 -3.534208 1.618092
O  -1.974397 2.9788 -0.611342
C  1.267645 -3.008342 -1.051961
C  1.360566 -1.663012 -0.411995
C  0.744655 -2.812384 0.358801
C  2.513323 -3.854848 -1.16473
C  0.319942 -3.194246 -2.212597
C  2.638016 -1.068121 0.032789
C  -0.685634 -2.82863 0.753141
C  2.701332 -0.15006 0.987816
C  -2.776725 -1.748191 0.45071
C  -3.217819 -0.438557 -0.137229
C  -2.361658 0.656693 -0.09661
C  -4.483293 -0.302351 -0.690223
C  -2.765286 1.871139 -0.631116
C  -4.889271 0.925655 -1.194658
C  -4.034397 2.013089 -1.179897
C  -0.61428 2.849293 -0.658258
C  0.012087 2.046534 -1.605212
C  0.135245 3.594395 0.238008
C  1.396046 1.991008 -1.63886
C  1.520313 3.536526 0.186339
C  2.156666 2.733933 -0.746874
H  0.64352 -0.929011 -0.769598
H  1.362978 -3.258717 1.129171
H  3.084493 -3.587668 -2.056348
H  3.172633 -3.752621 -0.302445
H  2.249006 -4.909868 -1.248453
H  -0.535292 -2.524524 -2.174063
H  0.844441 -3.005618 -3.150916
H  -0.054558 -4.2187 -2.246847
H  3.561583 -1.350011 -0.458524
H  -3.405622 -2.568929 0.096095
H  -2.852678 -1.729899 1.541161
H  -1.377882 0.560273 0.344874
H  -5.153032 -1.152169 -0.732935
H  -5.876497 1.031083 -1.62431
H  -4.337698 2.967667 -1.588903
H  -0.575325 1.473043 -2.311015
H  -0.368026 4.214472 0.968118
H  1.883761 1.36612 -2.375573
H  2.10353 4.114596 0.890534
H  3.236227 2.681966 -0.775883
totalener: -1958.42156613 hartree
nucrepener: 2714.07791769 hartree
electener: -4672.49948382 hartree
oneelecener: -8081.10177161 hartree
twoeener: 3408.60228780 hartree
kineticenergy: 1952.62587637 hartree
xcener: -143.519180143643 hartree
chargesum: -0.0000000
charge: -0.034914 -0.053016 -0.276364 -0.352374 -0.298772 0.127142 -0.027914 -0.073764 -0.283631 -0.254741 -0.235295 0.323353 0.113693 0.037718 0.029387 -0.155688 -0.191467 0.264859 -0.074526 -0.226430 0.263715 -0.182756 -0.187411 -0.131450 -0.101268 -0.145277 0.086138 0.093347 0.093294 0.082692 0.098022 0.090875 0.084144 0.096168 0.119394 0.095824 0.115531 0.069495 0.108850 0.124518 0.125038 0.134948 0.124785 0.129986 0.123857 0.130284
qa: -0.0349 -0.0530 -0.2764 -0.3524 -0.2988 0.1271 -0.0279 -0.0738 -0.2836 -0.2547 -0.2353 0.3234 0.1137 0.0377 0.0294 -0.1557 -0.1915 0.2649 -0.0745 -0.2264 0.2637 -0.1828 -0.1874 -0.1314 -0.1013 -0.1453 0.0861 0.0933 0.0933 0.0827 0.0980 0.0909 0.0841 0.0962 0.1194 0.0958 0.1155 0.0695 0.1089 0.1245 0.1250 0.1349 0.1248 0.1300 0.1239 0.1303
va: 1.3086 1.2545 2.0848 2.1558 2.1185 3.7674 3.8081 3.8554 3.9235 3.8925 3.8975 4.2405 4.1906 3.8440 3.7469 3.9026 4.0080 3.8081 3.9495 4.0437 3.7786 3.9118 4.0162 3.8710 3.9303 3.8670 1.0140 1.0261 0.9991 1.0031 1.0056 1.0178 1.0033 1.0019 1.0162 1.0035 1.0024 1.0596 1.0127 0.9993 1.0142 1.0028 1.0124 0.9993 1.0021 1.0072
dispcorr: -0.029546156 hartree
energy: -1958.451112281513
dipole: -10.12038 10.39476 0.27438 -14.79210 14.68476 -0.10734 -19.91171 18.82640 -1.08532
magnitude: 1.12460 au
magnitude: 2.85849 debye
