program: Gaussian 09
title: 000071980
version: EM64L-G09RevD.01
frameworkgroup: C1[X(C12H18N2O2)]
method: RPBEPBE
basis: SDD
operation: Freq
keyword: #p
keyword: freq=noraman
keyword: PBEPBE/SDD
title: #p freq=noraman PBEPBE/SDD
converged: YES YES NO NO
title: Mulliken charges:
elementType: O O N N C C C C C C C C C C C C H H H H H H H H H H H H H H H H H H
charge: -0.226294 -0.226992 -0.133639 -0.006112 -0.125583 -0.180180 -0.388578 -0.388087 0.430353 -0.225889 -0.631252 -0.644806 -0.367414 -0.467255 -0.185207 -0.356409 0.269967 0.192517 0.252808 0.217327 0.209778 0.227884 0.232756 0.184687 0.252497 0.190241 0.224593 0.196445 0.246951 0.222615 0.246081 0.280528 0.231641 0.244028
chargesum: 0.00000
title: Mulliken charges with hydrogens summed into heavy atoms:
elementType: O O N N C C C C C C C C C C C C
charge: -0.226294 -0.226992 -0.133639 -0.006112 0.144385 0.012338 0.081557 0.049575 0.430353 0.191553 0.036078 0.021204 -0.121334 -0.186727 0.046434 -0.112380
polarizability: 1.53870984e+02 -1.82532218e+01 1.44657441e+02 -4.62035226e-01 -3.23198489e+00 1.28108868e+02
1716.lowfreq: -3.3765 0.0005 0.0006 0.0007 12.4263 19.6620 46.3300 64.7904 80.6923
frequency: 46.0609 64.7416 80.6756 95.6133 116.2083 130.9432 178.7225 224.8445 228.5340 243.0611 248.1581 284.4116 303.8211 336.8622 360.4073 389.0709 401.1930 440.8304 449.6463 469.1808 521.0165 566.4691 608.0201 635.1808 703.7345 730.8029 783.1870 814.5197 837.1851 860.2428 867.0736 908.6825 914.7423 936.5461 955.8063 958.3005 987.9884 991.9780 1008.2659 1018.1672 1033.1724 1034.4463 1044.3658 1090.5020 1105.4456 1107.7225 1115.0148 1139.2043 1167.0672 1178.3930 1183.7201 1200.7023 1217.6880 1235.8218 1248.0134 1268.5851 1273.4448 1296.9811 1304.4386 1322.1323 1329.9149 1346.4805 1355.0445 1374.0887 1383.3291 1414.6852 1422.0103 1446.8707 1449.3276 1452.0835 1458.0979 1466.2870 1470.8547 1476.8477 1480.9066 1490.3566 1556.6397 1583.6191 2784.3578 2862.3010 2875.0037 2900.4289 2951.6862 2961.4863 3025.0818 3040.3015 3041.9091 3074.9195 3094.3909 3101.0472 3109.4711 3119.2320 3131.1560 3133.2913 3141.2189 3163.6914
redmass: 3.8722 4.7803 4.2886 3.0043 3.6837 3.3820 2.9915 1.3150 1.2412 3.6529 2.8139 2.6036 2.7285 3.1173 3.2441 2.6053 3.1277 4.1463 2.3133 2.9636 3.4400 4.3289 7.0017 4.7265 5.0549 1.8384 5.0849 2.0816 3.5641 4.5151 3.7962 1.5226 3.0682 1.3436 2.6510 2.2430 1.3973 3.1294 3.6027 3.0005 1.6330 2.3525 2.5603 1.2891 2.5209 2.2259 1.6741 1.5469 2.2860 1.0843 2.2057 1.5579 1.9054 1.6423 2.1346 1.1648 1.2200 1.6262 2.2146 1.4819 1.2346 1.3853 1.3311 1.3807 1.1683 1.9446 1.1594 1.0902 1.1912 2.0475 1.0993 1.0583 1.0619 1.0652 1.0531 1.0541 5.4699 5.9061 1.0799 1.0568 1.0568 1.0683 1.0658 1.0680 1.0822 1.0736 1.0735 1.0982 1.1001 1.1001 1.0953 1.0891 1.0967 1.0899 1.0918 1.0996
irintensity: 1.5522 0.5890 1.6175 1.6949 0.7933 0.5529 2.3604 0.5549 0.3364 0.2498 0.8725 1.3872 0.6475 8.7198 1.3287 7.8695 2.5033 8.6329 4.6607 0.6475 1.1974 0.8843 2.3858 4.1680 7.5539 47.5602 6.4966 19.3745 41.0640 65.1697 16.9351 2.2266 21.4314 0.4223 25.2052 21.6324 0.2406 22.8560 33.2900 68.1100 12.5169 0.1413 27.7129 9.8463 20.8973 59.6594 5.1944 6.1710 6.1827 3.7769 4.8419 2.7538 5.3488 5.4138 4.0722 0.6555 3.1935 6.5084 2.2783 6.6602 2.0199 5.7034 9.5924 4.4993 2.9675 28.8862 3.2089 1.6956 15.4867 14.1688 7.5853 21.1592 0.9820 2.0194 18.4116 19.3984 6.3576 0.7757 68.5809 58.2906 175.6906 90.4846 27.8270 61.4995 20.6334 19.5534 49.3157 28.2496 28.3613 32.1297 20.3584 6.5314 27.4941 19.3437 9.1026 25.9592
temp: 298.150 k
press: 1.00000 atm
elementType: 8 8 7 7 6 6 6 6 6 6 6 6 6 6 6 6 1 1 1 1 1 1 1 1 1 1 1 1 1 1 1 1 1 1
symmnumber: 1
zpe: 752069.3 jmol-1
zpe.correction: 0.286448 hartree
zpe.thermalcorrener: 0.301575 hartree
zpe.thermalcorrenthalpy: 0.302519 hartree
zpe.thermalcorrgfe: 0.244362 hartree
zpe.sumelectzpe: -726.729297 hartree
zpe.sumelectthermal: -726.714170 hartree
zpe.sumelectthermalent: -726.713226 hartree
zpe.sumelectthermalfe: -726.771383 hartree
dipole: 1.8611 0.9403 2.8692
dipole: 3.5469
quadrupole: -106.9235 -87.7332 -101.0435
quadrupole: -2.1534 8.3523 -0.4834
quadrupole: -8.3568 10.8336 -2.4768 -2.1534 8.3523 -0.4834
hfenergy: -727.0157452 hartree
pointgroup: C01 [X(C12H18N2O2)]
dipole: -0.6654719 0.3858791 -1.1642723 debye
polarizability: 155.430409|17.6307208|143.1809599|0.6300231|3.8144851|128.0259244 unknown
InChI: InChI=1S/C12H18N2O2/c1-14(2)12(10-4-3-5-13-6-10)11-7-15-9-16-8-11/h3-6,11-12H,7-9H2,1-2H3
charge 0 multiplicity 1
34 atoms
O  3.050028 -0.484957 1.298434
O  2.96331 -1.518503 -0.895859
N  -0.149199 2.271613 0.077681
N  -2.650719 -0.962733 1.377016
C  1.390888 0.310878 -0.347636
C  0.004975 0.969968 -0.641932
C  1.67484 0.04408 1.148319
C  1.588793 -1.019224 -1.114465
C  -1.160488 0.032158 -0.310245
C  3.189967 -1.714838 0.532611
C  -1.415216 2.953525 -0.288815
C  0.995263 3.196266 -0.097237
C  -1.783892 -0.746647 -1.314824
C  -1.645372 -0.111375 1.017853
C  -2.826193 -1.634514 -0.96601
C  -3.220868 -1.71617 0.388501
H  2.182329 0.990571 -0.714914
H  -0.014888 1.141249 -1.75512
H  1.637517 0.961544 1.75337
H  0.953359 -0.693147 1.561172
H  0.860368 -1.786502 -0.773671
H  1.495136 -0.886947 -2.205296
H  4.232587 -2.041216 0.643305
H  2.46455 -2.471811 0.916539
H  -2.28013 2.307439 -0.069872
H  -1.457513 3.23481 -1.371136
H  -1.518275 3.874403 0.310754
H  1.217196 3.424769 -1.169897
H  1.911077 2.79737 0.367477
H  0.756838 4.147876 0.408709
H  -1.461731 -0.653153 -2.359339
H  -1.226077 0.507399 1.818702
H  -3.326438 -2.246124 -1.723504
H  -4.021122 -2.394756 0.705229
