program: Orca
programVersion: 5.0.3
elementType: Cl Cl O O O C C C C C C C C C C C C C C C C C C C C C H H H H H H H H H H H H H H H H H H H H
charge: 0
multiplicity: 1
keywords: wb97x-d3
keywords: def2-TZVPP
keywords: def2/J RIJCOSX
keywords: DEFGRID2
keywords: scfconv7
keywords: smallprint printgap noloewdin
keywords: NOSOSCF
formula: C21H20Cl2O3
InChI: InChI=1/C21H20Cl2O3/c1-21(2)17(12-18(22)23)19(21)20(24)25-13-14-7-6-10-16(11-14)26-15-8-4-3-5-9-15/h3-12,17,19H,13H2,1-2H3
46 atoms
Cl 3.185583 -1.228543 -3.016848
Cl 5.198373 -0.979024 -0.966234
O  -1.491185 -2.166666 1.012077
O  -1.308032 -2.503693 -1.194298
O  -2.548761 2.949569 2.16439
C  1.161903 -4.211939 -0.295112
C  1.601238 -2.889665 -0.8538
C  0.55367 -2.933279 0.240829
C  2.066191 -4.962119 0.655102
C  0.370528 -5.128477 -1.196638
C  2.919793 -2.314823 -0.565183
C  -0.829305 -2.517732 -0.09114
C  3.658603 -1.605232 -1.409438
C  -2.836509 -1.703443 0.857239
C  -2.88484 -0.248995 0.486213
C  -2.66452 0.713693 1.464999
C  -3.129251 0.148226 -0.822281
C  -2.706112 2.06092 1.142755
C  -3.168127 1.498286 -1.136645
C  -2.961949 2.461962 -0.163512
C  -1.866477 4.113222 1.957434
C  -2.381432 5.264684 2.534617
C  -0.671859 4.153209 1.248286
C  -1.693846 6.461466 2.404175
C  -0.000347 5.35853 1.117702
C  -0.505089 6.516204 1.692283
H  1.199744 -2.661797 -1.834432
H  0.876911 -2.65461 1.237624
H  1.488614 -5.687336 1.230081
H  2.833201 -5.509289 0.104781
H  2.57025 -4.314895 1.371948
H  1.054116 -5.77955 -1.74381
H  -0.294142 -5.766844 -0.61136
H  -0.233643 -4.592868 -1.9239
H  3.339561 -2.469652 0.420806
H  -3.369836 -2.311569 0.125222
H  -3.29528 -1.865091 1.832492
H  -2.469604 0.423464 2.490622
H  -3.281211 -0.595466 -1.592403
H  -3.366795 1.808006 -2.153965
H  -3.006077 3.512907 -0.418269
H  -3.31174 5.214659 3.084899
H  -0.266053 3.252618 0.805635
H  -2.096911 7.35757 2.857233
H  0.930682 5.388068 0.567237
H  0.026207 7.452405 1.588601
totalener: -1958.42693254 hartree
nucrepener: 2440.23855325 hartree
electener: -4398.66548579 hartree
oneelecener: -7533.74455965 hartree
twoeener: 3135.07907387 hartree
kineticenergy: 1952.62353510 hartree
xcener: -143.513690787946 hartree
chargesum: -0.0000000
charge: -0.040854 -0.050084 -0.263350 -0.397284 -0.300003 0.068862 0.044345 -0.083474 -0.252044 -0.250431 -0.204342 0.369249 0.052073 0.049301 -0.006444 -0.227407 -0.111529 0.216590 -0.123141 -0.152100 0.234648 -0.206612 -0.156998 -0.093195 -0.118349 -0.142395 0.085003 0.075999 0.092529 0.099227 0.073612 0.087806 0.085020 0.103405 0.094631 0.107873 0.110766 0.110589 0.121361 0.127255 0.133505 0.124458 0.134457 0.124308 0.127862 0.125304
qa: -0.0409 -0.0501 -0.2634 -0.3973 -0.3000 0.0689 0.0443 -0.0835 -0.2520 -0.2504 -0.2043 0.3692 0.0521 0.0493 -0.0064 -0.2274 -0.1115 0.2166 -0.1231 -0.1521 0.2346 -0.2066 -0.1570 -0.0932 -0.1183 -0.1424 0.0850 0.0760 0.0925 0.0992 0.0736 0.0878 0.0850 0.1034 0.0946 0.1079 0.1108 0.1106 0.1214 0.1273 0.1335 0.1245 0.1345 0.1243 0.1279 0.1253
va: 1.2865 1.2550 2.1369 2.1032 2.1015 3.7556 3.8217 3.8475 3.9123 3.9123 3.9270 4.2298 4.2479 3.8480 3.6845 4.0813 3.9515 3.8690 3.9730 3.9393 3.8140 4.0345 3.9400 3.9351 3.9501 3.9574 1.0518 1.0352 1.0044 1.0022 1.0100 1.0013 1.0018 1.0227 1.0323 1.0111 0.9955 1.0251 1.0232 1.0012 1.0030 1.0140 1.0033 0.9991 0.9999 1.0004
dispcorr: -0.021180729 hartree
energy: -1958.448113268759
dipole: -21.72046 21.49948 -0.22098 -6.55485 6.23380 -0.32105 11.97072 -11.39510 0.57562
magnitude: 0.69516 au
magnitude: 1.76695 debye
