program: Orca
programVersion: 5.0.3
elementType: Cl Cl O O O C C C C C C C C C C C C C C C C C C C C C H H H H H H H H H H H H H H H H H H H H
charge: 0
multiplicity: 1
keywords: wb97x-d3
keywords: def2-TZVPP
keywords: def2/J RIJCOSX
keywords: DEFGRID2
keywords: scfconv7
keywords: smallprint printgap noloewdin
keywords: NOSOSCF
formula: C21H20Cl2O3
InChI: InChI=1/C21H20Cl2O3/c1-21(2)17(12-18(22)23)19(21)20(24)25-13-14-7-6-10-16(11-14)26-15-8-4-3-5-9-15/h3-12,17,19H,13H2,1-2H3
46 atoms
Cl 2.042863 -1.344907 1.740195
Cl 4.158319 -3.171011 2.483265
O  -1.451672 -1.958744 -0.207712
O  -0.179236 -0.919505 -1.725165
O  -0.982721 3.872027 0.220442
C  1.308023 -3.683895 -1.878182
C  2.026414 -2.756318 -0.958542
C  0.543951 -2.9898 -0.765984
C  1.493901 -5.172109 -1.698611
C  1.119283 -3.274908 -3.318386
C  2.970809 -3.221257 0.080171
C  -0.367183 -1.845315 -0.982677
C  3.049172 -2.656183 1.278397
C  -2.324599 -0.834408 -0.16575
C  -1.719723 0.305667 0.604912
C  -1.640464 1.565286 0.034157
C  -1.231942 0.099513 1.892749
C  -1.102935 2.624011 0.756936
C  -0.671102 1.15347 2.593618
C  -0.612156 2.42296 2.036807
C  -2.009427 4.388527 -0.514306
C  -3.34009 4.220718 -0.148085
C  -1.679011 5.141348 -1.631982
C  -4.335813 4.803283 -0.915961
C  -2.685276 5.727792 -2.38399
C  -4.016873 5.556908 -2.036274
H  2.260023 -1.780738 -1.377964
H  0.267023 -3.627863 0.065338
H  0.639899 -5.71523 -2.1055
H  2.384866 -5.515748 -2.228116
H  1.597031 -5.459825 -0.651784
H  1.024072 -2.199682 -3.442278
H  1.974329 -3.607519 -3.909408
H  0.227224 -3.742136 -3.73883
H  3.647817 -4.038085 -0.1405
H  -2.604775 -0.517583 -1.17245
H  -3.221692 -1.202839 0.333174
H  -1.982528 1.718573 -0.982039
H  -1.280468 -0.883341 2.343802
H  -0.286706 0.992919 3.59225
H  -0.184241 3.252489 2.583788
H  -3.598659 3.64359 0.730355
H  -0.638724 5.2641 -1.903042
H  -5.370547 4.669632 -0.628901
H  -2.423162 6.314738 -3.254299
H  -4.79911 6.009674 -2.630059
totalener: -1958.42382275 hartree
nucrepener: 2536.38642958 hartree
electener: -4494.81025233 hartree
oneelecener: -7726.35464291 hartree
twoeener: 3231.54439058 hartree
kineticenergy: 1952.63785277 hartree
xcener: -143.516695039462 hartree
chargesum: 0.0000000
charge: -0.032826 -0.045478 -0.266341 -0.381791 -0.300387 0.123091 -0.031930 -0.125402 -0.272211 -0.250782 -0.249152 0.350502 0.099605 0.064743 0.060842 -0.118430 -0.293106 0.208103 -0.070377 -0.201725 0.233925 -0.151626 -0.205501 -0.120637 -0.091970 -0.146123 0.114538 0.096382 0.094143 0.093969 0.084637 0.104059 0.083570 0.085279 0.117602 0.098881 0.110551 0.115904 0.125711 0.131962 0.126868 0.129755 0.125918 0.125699 0.124858 0.124699
qa: -0.0328 -0.0455 -0.2663 -0.3818 -0.3004 0.1231 -0.0319 -0.1254 -0.2722 -0.2508 -0.2492 0.3505 0.0996 0.0647 0.0608 -0.1184 -0.2931 0.2081 -0.0704 -0.2017 0.2339 -0.1516 -0.2055 -0.1206 -0.0920 -0.1461 0.1145 0.0964 0.0941 0.0940 0.0846 0.1041 0.0836 0.0853 0.1176 0.0989 0.1106 0.1159 0.1257 0.1320 0.1269 0.1298 0.1259 0.1257 0.1249 0.1247
va: 1.3152 1.2614 2.1209 2.1200 2.1070 3.7288 3.8477 3.8541 3.9119 3.8972 3.9208 4.2037 4.2002 3.8664 3.6189 3.9298 3.9767 3.8486 3.8666 4.0473 3.8283 3.9278 4.0337 3.9518 3.9348 3.9609 1.0263 1.0277 1.0067 1.0007 1.0012 1.0235 1.0022 1.0022 1.0160 1.0119 0.9888 1.0180 1.0200 0.9967 1.0110 1.0054 1.0137 1.0001 0.9988 1.0005
dispcorr: -0.024064089 hartree
energy: -1958.447886843348
dipole: -19.25274 18.73277 -0.51997 0.52833 -1.30861 -0.78028 -23.31844 23.03050 -0.28794
magnitude: 0.98087 au
magnitude: 2.49318 debye
