program: Gaussian 09
title: 000071976
version: EM64L-G09RevD.01
frameworkgroup: C1[X(C17H32O3)]
method: RPBEPBE
basis: SDD
operation: Freq
keyword: #pfreq=noraman
keyword: PBEPBE/SDD
title: #p freq=noraman PBEPBE/SDD
converged: YES YES NO NO
title: Mulliken charges:
elementType: O O O C C C C C C C C C C C C C C C C C H H H H H H H H H H H H H H H H H H H H H H H H H H H H H H H H
charge: -0.275265 -0.415252 -0.221020 0.298620 -0.471622 -0.415736 -0.403611 -0.378340 -0.389336 0.137433 -0.386754 -0.386256 -0.386310 -0.385932 -0.384743 -0.382093 -0.372737 -0.353434 -0.356673 -0.696778 0.237967 0.215538 0.219563 0.247492 0.197681 0.230104 0.202869 0.195879 0.193244 0.199918 0.193356 0.196610 0.192847 0.195190 0.194477 0.193104 0.193972 0.192865 0.193338 0.192591 0.192084 0.191479 0.189501 0.189083 0.187688 0.187372 0.386458 0.194837 0.194640 0.209520 0.209667 0.214903
chargesum: 0.00000
title: Mulliken charges with hydrogens summed into heavy atoms:
elementType: O O O C C C C C C C C C C C C C C C C C
charge: -0.275265 -0.028794 -0.221020 0.298620 -0.018117 0.051319 0.024174 0.020408 0.003826 0.137433 0.003212 0.001782 0.001271 0.000906 0.001186 0.001470 0.005848 0.021627 0.032804 -0.062688
polarizability: 2.53355535e+02 -2.01722055e+00 1.69330948e+02 8.07929536e+00 -3.23710897e+00 1.62567470e+02
1716.lowfreq: -4.3373 -0.0016 0.0006 0.0010 3.5674 10.0443 14.4493 15.8811 29.6129
frequency: 13.9539 15.4625 29.4872 39.1477 40.6452 51.0854 53.8860 58.2158 80.4876 84.5628 90.3101 111.4445 113.3209 120.0003 134.7560 140.2983 150.9539 153.2371 158.4738 204.6931 231.5557 237.1902 261.5318 272.5005 295.2974 341.4419 350.8865 383.6218 429.5578 458.0627 474.8596 489.4992 504.2095 533.4807 575.6040 686.6346 702.8404 721.3459 722.0184 723.7350 728.2277 737.9490 755.4680 769.1381 788.5672 818.4787 843.1312 871.7170 887.3197 911.1241 927.0225 960.0600 975.0855 983.7997 998.3731 1002.2325 1014.1561 1024.5601 1035.8849 1040.0656 1049.0040 1061.9721 1066.1591 1076.5910 1078.2088 1080.6105 1081.3313 1087.5003 1090.9108 1123.8292 1138.0187 1180.3349 1192.1421 1197.0371 1209.1585 1221.5536 1225.1683 1240.6886 1245.1432 1258.1558 1266.3428 1275.4831 1279.4577 1284.4607 1285.1606 1289.7511 1292.1270 1294.8473 1297.8047 1299.0589 1306.4711 1320.4192 1331.1459 1342.8145 1351.1833 1352.9964 1354.8058 1356.6388 1357.6522 1363.4740 1388.4334 1454.8333 1458.4904 1458.6976 1461.0137 1461.5270 1463.8740 1464.2721 1467.5571 1471.5871 1473.6977 1476.5020 1477.4912 1480.6672 1484.3763 1487.1620 1488.5899 1648.5352 2947.4576 2947.6063 2949.0019 2949.3003 2950.7337 2951.5031 2953.4922 2956.6654 2960.4216 2963.9304 2967.6808 2969.4482 2970.7357 2981.0169 2982.9097 2985.8285 2989.8967 2995.2407 3000.3039 3002.5326 3010.2948 3018.8524 3027.0088 3034.1447 3039.9898 3044.0317 3067.2758 3067.3906 3069.8799 3070.7546 3187.3122 3524.0599
redmass: 4.8086 4.6314 4.1396 1.9091 5.7359 4.4933 3.5524 1.7245 3.2471 1.6629 3.8719 1.6390 2.9549 4.4170 1.7398 2.4751 1.9196 3.7771 2.1209 3.8499 1.1128 4.1885 4.0308 4.2067 3.7772 2.6742 3.4041 3.8395 3.0997 3.5520 6.2075 3.0094 3.0788 3.3461 1.2943 4.5467 4.8531 1.0595 1.0608 1.0724 1.0934 1.1323 1.2552 3.7925 1.3286 1.4656 2.1293 1.3401 1.9003 1.2409 1.5423 1.3024 5.3979 4.0409 1.3858 4.2110 2.2031 3.0480 1.1525 3.0092 3.1779 1.3462 2.6995 2.4572 2.0631 2.2154 2.1529 1.6548 2.3714 3.0138 1.3029 1.9553 1.6657 1.3127 1.6418 1.3085 1.5219 1.3603 1.3295 1.3091 1.2985 1.2556 1.0149 1.0665 1.1928 1.1673 1.1065 1.1449 1.1093 1.1157 1.4108 1.8437 1.8243 1.5956 1.6097 1.7000 1.6727 1.6417 1.6264 3.0000 1.2173 1.1119 1.0748 1.0762 1.0731 1.0727 1.0619 1.0775 1.0843 1.0948 1.1327 1.0896 1.0429 1.0911 1.0941 1.0959 1.0948 9.1771 1.0586 1.0586 1.0590 1.0589 1.0593 1.0593 1.0595 1.0594 1.0591 1.0587 1.0585 1.0621 1.0367 1.0961 1.0966 1.0975 1.0987 1.0996 1.0705 1.0926 1.1026 1.1036 1.1039 1.1041 1.1042 1.1043 1.1007 1.1008 1.0993 1.0569 1.1176 1.0643
irintensity: 0.2052 0.1050 0.1290 0.2783 0.8923 0.5842 0.4921 0.1146 0.0998 0.0362 0.4079 0.0209 0.2175 0.1025 0.0358 0.0683 0.0806 0.5830 0.0534 1.1570 0.0136 2.9701 0.7239 3.6639 1.4904 4.6231 0.4598 8.2437 0.4402 13.8576 3.5382 3.3701 5.8525 43.8261 100.1094 35.8272 43.1406 15.6998 8.4569 7.3977 0.2239 3.7275 1.1846 4.1997 2.9011 3.6884 11.3500 2.7409 4.9570 1.4066 2.2929 4.3279 0.0793 5.4861 28.3446 0.5549 105.8144 55.2863 16.3869 15.7736 4.7101 2.0134 2.8535 0.7957 1.1886 4.1150 1.1001 52.5601 2.1352 11.5910 9.9673 0.0518 3.2532 26.7187 1.4531 0.8682 2.4069 1.4675 2.1921 1.0473 1.0951 1.8923 0.2278 0.1920 0.1263 1.9615 0.3300 2.7449 0.0960 0.4586 4.0966 3.3267 2.6556 2.1884 0.3428 0.2153 0.7055 0.2358 0.1951 23.4905 11.2972 6.6906 0.0023 0.2879 0.0296 0.3421 0.1027 0.1093 0.3115 0.7797 1.8187 1.9749 12.0012 1.6785 2.1884 6.8569 46.2285 231.2789 0.0064 0.0395 0.0055 0.1540 0.2482 0.6504 0.2019 5.3760 0.3773 135.4969 176.4254 110.4513 37.5834 0.3450 0.5899 0.7077 0.6037 0.2066 16.2746 8.5346 2.0171 0.6926 5.6674 3.1104 19.3569 341.5811 19.0105 114.3182 55.7459 39.6567 11.9338 36.1409
temp: 298.150 k
press: 1.00000 atm
elementType: 8 8 8 6 6 6 6 6 6 6 6 6 6 6 6 6 6 6 6 6 1 1 1 1 1 1 1 1 1 1 1 1 1 1 1 1 1 1 1 1 1 1 1 1 1 1 1 1 1 1 1 1
symmnumber: 1
zpe: 1205969.0 jmol-1
zpe.correction: 0.459329 hartree
zpe.thermalcorrener: 0.484724 hartree
zpe.thermalcorrenthalpy: 0.485668 hartree
zpe.thermalcorrgfe: 0.398730 hartree
zpe.sumelectzpe: -891.003327 hartree
zpe.sumelectthermal: -890.977932 hartree
zpe.sumelectthermalent: -890.976988 hartree
zpe.sumelectthermalfe: -891.063927 hartree
dipole: -1.1818 0.2725 2.1097
dipole: 2.4335
quadrupole: -142.4891 -124.3916 -125.5100
quadrupole: 9.9663 15.6646 -0.4687
quadrupole: -11.6922 6.4053 5.2869 9.9663 15.6646 -0.4687
hfenergy: -891.4626566 hartree
pointgroup: C01 [X(C17H32O3)]
dipole: -0.4716266 -0.1303237 -0.822943 debye
polarizability: 253.2411132|1.4281848|169.1183381|-8.8244769|-3.4140089|162.8945019 unknown
InChI: InChI=1S/C17H32O3/c1-2-3-4-5-6-7-8-9-10-11-12-13-14-17(15-20-17)16(18)19/h18H,2-15H2,1H3
charge 0 multiplicity 1
52 atoms
O  7.752045 1.265848 -0.054037
O  8.050475 -1.560604 -0.697513
O  6.451691 -1.888211 0.954088
C  6.580332 0.291423 -0.162481
C  5.282785 0.739638 0.486532
C  7.114274 0.987891 -1.383967
C  4.031581 0.110249 -0.174346
C  2.717044 0.627462 0.450973
C  1.45743 -0.003729 -0.182606
C  6.987979 -1.139331 0.10693
C  0.138716 0.52739 0.422868
C  -1.122292 -0.109352 -0.203455
C  -2.44169 0.433379 0.390216
C  -3.703193 -0.205429 -0.233242
C  -5.022696 0.344416 0.353778
C  -6.284553 -0.294355 -0.26909
C  -7.603953 0.259966 0.314264
C  -8.866447 -0.377866 -0.308362
C  -10.185494 0.179005 0.274616
C  -11.441748 -0.462712 -0.353378
H  5.302787 0.477573 1.560658
H  5.232874 1.842785 0.415705
H  6.521335 1.816701 -1.792602
H  7.747289 0.436814 -2.086806
H  4.032474 0.332584 -1.261584
H  4.076453 -0.991126 -0.069535
H  2.723909 0.417998 1.540624
H  2.667553 1.73174 0.34559
H  1.460691 0.187452 -1.276333
H  1.499425 -1.106014 -0.059563
H  0.094593 1.629423 0.294522
H  0.137217 0.3422 1.517415
H  -1.115226 0.065946 -1.299849
H  -1.084075 -1.210266 -0.065174
H  -2.448138 0.26127 1.487016
H  -2.480825 1.534011 0.24893
H  -3.667547 -1.305401 -0.086514
H  -3.693615 -0.038659 -1.330938
H  -5.032316 0.178671 1.451582
H  -5.05831 1.444329 0.206142
H  -6.251135 -1.393885 -0.118414
H  -6.27316 -0.131662 -1.367375
H  -7.615479 0.097468 1.412599
H  -7.637085 1.359557 0.163406
H  -8.835916 -1.477384 -0.156584
H  -8.856089 -0.216424 -1.406875
H  8.318497 -2.480867 -0.430674
H  -10.194942 0.016847 1.371958
H  -10.214552 1.277545 0.123243
H  -11.470559 -0.289619 -1.445929
H  -11.452087 -1.556812 -0.188116
H  -12.370426 -0.046871 0.079287
