program: Orca
programVersion: 5.0.3
elementType: Cl Cl O O O C C C C C C C C C C C C C C C C C C C C C H H H H H H H H H H H H H H H H H H H H
charge: 0
multiplicity: 1
keywords: wb97x-d3
keywords: def2-TZVPP
keywords: def2/J RIJCOSX
keywords: DEFGRID2
keywords: scfconv7
keywords: smallprint printgap noloewdin
keywords: NOSOSCF
formula: C21H20Cl2O3
InChI: InChI=1/C21H20Cl2O3/c1-21(2)17(12-18(22)23)19(21)20(24)25-13-14-7-6-10-16(11-14)26-15-8-4-3-5-9-15/h3-12,17,19H,13H2,1-2H3
46 atoms
Cl 1.480935 -0.285128 -0.431847
Cl 4.354393 -0.606348 -0.460442
O  -1.507167 -2.442077 0.943468
O  -1.600343 -3.001565 -1.222047
O  -0.659147 2.665697 1.396455
C  1.013181 -4.622551 -0.608733
C  1.347239 -3.268424 -1.135138
C  0.395248 -3.39705 0.035186
C  2.037083 -5.338912 0.239901
C  0.187668 -5.55235 -1.463707
C  2.666904 -2.630169 -0.939475
C  -0.999591 -2.954722 -0.180764
C  2.812557 -1.343407 -0.648916
C  -2.708354 -1.675992 0.826245
C  -2.391532 -0.315001 0.274612
C  -1.725353 0.603984 1.077622
C  -2.696414 0.015895 -1.039002
C  -1.356482 1.838961 0.567902
C  -2.325549 1.25423 -1.541059
C  -1.649215 2.168767 -0.75127
C  -0.812489 4.018326 1.300476
C  0.333824 4.79707 1.356767
C  -2.06512 4.612783 1.205494
C  0.224341 6.178861 1.321064
C  -2.15896 5.994652 1.158734
C  -1.018992 6.783731 1.215565
H  0.852862 -3.004637 -2.067029
H  0.799296 -3.136599 1.00648
H  2.610763 -4.657456 0.868736
H  1.550256 -6.061251 0.89659
H  2.74256 -5.887184 -0.387484
H  -0.525328 -5.026289 -2.092654
H  0.844767 -6.134268 -2.112416
H  -0.368275 -6.256539 -0.842374
H  3.564387 -3.223886 -1.06852
H  -3.447858 -2.192853 0.212876
H  -3.094752 -1.607781 1.842904
H  -1.477039 0.362063 2.104333
H  -3.19945 -0.701053 -1.673184
H  -2.550455 1.507564 -2.568552
H  -1.350837 3.125212 -1.160173
H  1.300425 4.316861 1.433115
H  -2.959311 4.003788 1.170535
H  1.120043 6.783883 1.368188
H  -3.134407 6.456721 1.083438
H  -1.100512 7.861571 1.181467
totalener: -1958.42376191 hartree
nucrepener: 2577.36568525 hartree
electener: -4535.78944716 hartree
oneelecener: -7808.43244545 hartree
twoeener: 3272.64299829 hartree
kineticenergy: 1952.63136825 hartree
xcener: -143.515207961550 hartree
chargesum: 0.0000000
charge: -0.029983 -0.048448 -0.260840 -0.394634 -0.295401 0.131609 -0.034579 -0.123836 -0.272435 -0.252377 -0.248738 0.352607 0.102775 0.062481 0.015019 -0.268762 -0.114159 0.220401 -0.113695 -0.151847 0.236379 -0.203230 -0.163803 -0.094046 -0.116278 -0.141573 0.110793 0.100460 0.085708 0.094568 0.092526 0.103788 0.082305 0.084841 0.117452 0.104794 0.108670 0.108229 0.118657 0.126452 0.132779 0.126489 0.131992 0.125078 0.126496 0.125318
qa: -0.0300 -0.0484 -0.2608 -0.3946 -0.2954 0.1316 -0.0346 -0.1238 -0.2724 -0.2524 -0.2487 0.3526 0.1028 0.0625 0.0150 -0.2688 -0.1142 0.2204 -0.1137 -0.1518 0.2364 -0.2032 -0.1638 -0.0940 -0.1163 -0.1416 0.1108 0.1005 0.0857 0.0946 0.0925 0.1038 0.0823 0.0848 0.1175 0.1048 0.1087 0.1082 0.1187 0.1265 0.1328 0.1265 0.1320 0.1251 0.1265 0.1253
va: 1.3237 1.2576 2.1232 2.1003 2.0960 3.7107 3.8599 3.8595 3.9134 3.8953 3.9108 4.2025 4.2011 3.8527 3.6546 4.0593 3.9620 3.7916 3.9716 3.9305 3.8200 4.0353 3.9467 3.9321 3.9460 3.9573 1.0277 1.0266 1.0010 1.0064 1.0011 1.0232 1.0021 1.0026 1.0167 1.0114 0.9942 1.0302 1.0211 1.0008 1.0036 1.0143 1.0041 0.9991 1.0000 1.0004
dispcorr: -0.024661037 hartree
energy: -1958.448422949599
dipole: -15.55399 15.46529 -0.08870 -11.33846 11.14461 -0.19385 -0.06414 0.18472 0.12058
magnitude: 0.24492 au
magnitude: 0.62253 debye
