program: Orca
programVersion: 5.0.3
elementType: Cl Cl O O O C C C C C C C C C C C C C C C C C C C C C H H H H H H H H H H H H H H H H H H H H
charge: 0
multiplicity: 1
keywords: wb97x-d3
keywords: def2-TZVPP
keywords: def2/J RIJCOSX
keywords: DEFGRID2
keywords: scfconv7
keywords: smallprint printgap noloewdin
keywords: NOSOSCF
formula: C21H20Cl2O3
InChI: InChI=1/C21H20Cl2O3/c1-21(2)17(12-18(22)23)19(21)20(24)25-13-14-7-6-10-16(11-14)26-15-8-4-3-5-9-15/h3-12,17,19H,13H2,1-2H3
46 atoms
Cl 3.209416 -2.721733 1.657536
Cl 5.076306 -4.23487 0.054454
O  -1.092138 -1.754681 0.902517
O  0.205995 0.020915 0.488724
O  -3.325996 3.503688 -0.064752
C  0.937919 -1.811107 -1.984168
C  2.072951 -1.692912 -1.020547
C  0.71568 -2.092747 -0.506613
C  0.872996 -3.018361 -2.888693
C  0.386241 -0.557326 -2.617328
C  3.191734 -2.661363 -1.016748
C  -0.047338 -1.144644 0.336018
C  3.749704 -3.142292 0.085894
C  -2.011355 -0.927296 1.616896
C  -2.797251 -0.046385 0.68636
C  -2.682542 1.33263 0.77275
C  -3.620756 -0.613363 -0.281096
C  -3.377028 2.144766 -0.115125
C  -4.320589 0.203702 -1.153617
C  -4.197281 1.582421 -1.082574
C  -2.178442 4.154551 0.286341
C  -2.328231 5.335749 0.999622
C  -0.914366 3.711838 -0.08507
C  -1.208734 6.078065 1.340352
C  0.196729 4.460253 0.272657
C  0.058887 5.643023 0.983466
H  2.358464 -0.675465 -0.76388
H  0.568784 -3.137788 -0.258085
H  1.46478 -2.857566 -3.792379
H  1.241104 -3.924461 -2.406406
H  -0.15578 -3.206095 -3.199488
H  -0.674629 -0.671825 -2.847465
H  0.496383 0.31942 -1.983603
H  0.908798 -0.356585 -3.554431
H  3.610885 -2.974712 -1.965815
H  -2.665481 -1.630676 2.132189
H  -1.491737 -0.333011 2.371304
H  -2.029672 1.767721 1.518561
H  -3.714121 -1.689739 -0.353418
H  -4.964406 -0.233777 -1.905186
H  -4.733068 2.225813 -1.767854
H  -3.320194 5.666267 1.278282
H  -0.787355 2.788659 -0.63531
H  -1.330687 6.998819 1.895513
H  1.179949 4.108507 -0.010155
H  0.931738 6.220047 1.257047
totalener: -1958.42438798 hartree
nucrepener: 2529.34649290 hartree
electener: -4487.77088088 hartree
oneelecener: -7712.08331844 hartree
twoeener: 3224.31243756 hartree
kineticenergy: 1952.62491803 hartree
xcener: -143.514272299565 hartree
chargesum: 0.0000000
charge: -0.032438 -0.044401 -0.261150 -0.386233 -0.298856 0.119453 -0.020041 -0.140401 -0.276772 -0.238511 -0.239696 0.365121 0.084595 0.054685 0.019803 -0.160633 -0.231780 0.258621 -0.071352 -0.222116 0.268796 -0.221295 -0.169004 -0.087962 -0.116352 -0.146571 0.108575 0.098606 0.092797 0.087187 0.094897 0.090327 0.084291 0.088046 0.117222 0.115295 0.102839 0.122756 0.113859 0.124777 0.124949 0.122146 0.133791 0.123515 0.124926 0.123688
qa: -0.0324 -0.0444 -0.2611 -0.3862 -0.2989 0.1195 -0.0200 -0.1404 -0.2768 -0.2385 -0.2397 0.3651 0.0846 0.0547 0.0198 -0.1606 -0.2318 0.2586 -0.0714 -0.2221 0.2688 -0.2213 -0.1690 -0.0880 -0.1164 -0.1466 0.1086 0.0986 0.0928 0.0872 0.0949 0.0903 0.0843 0.0880 0.1172 0.1153 0.1028 0.1228 0.1139 0.1248 0.1249 0.1221 0.1338 0.1235 0.1249 0.1237
va: 1.2994 1.2615 2.1285 2.1152 2.1179 3.7418 3.8434 3.8426 3.9127 3.9007 3.9055 4.2096 4.2090 3.8595 3.6545 3.9172 4.0099 3.8369 3.9079 4.0495 3.7945 4.0368 3.9420 3.9307 3.9568 3.9603 1.0267 1.0267 1.0012 1.0008 1.0061 1.0031 1.0228 1.0044 1.0163 0.9902 1.0099 1.0167 1.0163 0.9986 1.0133 1.0155 0.9972 0.9990 1.0004 1.0006
dispcorr: -0.024173170 hartree
energy: -1958.448561155210
dipole: -23.60087 23.28020 -0.32067 17.51061 -17.94109 -0.43048 -16.43654 15.83335 -0.60319
magnitude: 0.80745 au
magnitude: 2.05238 debye
