program: Orca
programVersion: 5.0.3
elementType: Cl Cl O O O C C C C C C C C C C C C C C C C C C C C C H H H H H H H H H H H H H H H H H H H H
charge: 0
multiplicity: 1
keywords: wb97x-d3
keywords: def2-TZVPP
keywords: def2/J RIJCOSX
keywords: DEFGRID2
keywords: scfconv7
keywords: smallprint printgap noloewdin
keywords: NOSOSCF
formula: C21H20Cl2O3
InChI: InChI=1/C21H20Cl2O3/c1-21(2)17(12-18(22)23)19(21)20(24)25-13-14-7-6-10-16(11-14)26-15-8-4-3-5-9-15/h3-12,17,19H,13H2,1-2H3
46 atoms
Cl 1.525661 -0.226455 -0.323703
Cl 4.396884 -0.547976 -0.207888
O  -1.567325 -2.439506 0.884563
O  -1.497633 -2.906944 -1.302774
O  -0.676113 2.614537 1.31852
C  1.061339 -4.558108 -0.533795
C  1.426266 -3.205347 -1.043011
C  0.41142 -3.328963 0.07221
C  2.035386 -5.27534 0.37084
C  0.278906 -5.486672 -1.429552
C  2.734991 -2.57043 -0.775905
C  -0.971274 -2.894479 -0.221577
C  2.86691 -1.284693 -0.474746
C  -2.775191 -1.697785 0.707447
C  -2.465724 -0.325399 0.179852
C  -1.764767 0.567124 0.983386
C  -2.82186 0.045911 -1.108885
C  -1.414153 1.816312 0.496947
C  -2.473997 1.300916 -1.585946
C  -1.764251 2.189689 -0.796449
C  -0.839935 3.968787 1.284318
C  0.304414 4.751807 1.322956
C  -2.098311 4.558686 1.266436
C  0.187059 6.133177 1.347406
C  -2.200343 5.940684 1.279307
C  -1.062594 6.733931 1.320504
H  0.984543 -2.941554 -2.001015
H  0.758992 -3.069234 1.065333
H  1.510838 -5.989589 1.006869
H  2.767847 -5.83307 -0.216062
H  2.581274 -4.592911 1.022995
H  -0.399722 -4.959393 -2.094169
H  0.965717 -6.07005 -2.044374
H  -0.30976 -6.188893 -0.837504
H  3.63729 -3.164516 -0.861871
H  -3.470562 -2.225877 0.053115
H  -3.21614 -1.64547 1.702814
H  -1.473805 0.292889 1.990445
H  -3.347756 -0.65266 -1.745412
H  -2.740427 1.58622 -2.594904
H  -1.482152 3.158901 -1.186542
H  1.275625 4.274974 1.33884
H  -2.990484 3.946074 1.24527
H  1.08119 6.74147 1.38121
H  -3.180277 6.399361 1.266074
H  -1.15032 7.811773 1.333023
totalener: -1958.42383918 hartree
nucrepener: 2578.52639908 hartree
electener: -4536.95023827 hartree
oneelecener: -7810.77037374 hartree
twoeener: 3273.82013547 hartree
kineticenergy: 1952.63624006 hartree
xcener: -143.516151828476 hartree
chargesum: 0.0000000
charge: -0.028800 -0.048198 -0.262901 -0.390938 -0.294966 0.128954 -0.029754 -0.125623 -0.272265 -0.253359 -0.252048 0.352153 0.102021 0.066004 0.033874 -0.295092 -0.115313 0.228463 -0.112178 -0.150876 0.236470 -0.204333 -0.164547 -0.094135 -0.116421 -0.141605 0.111183 0.100201 0.094637 0.092523 0.085736 0.103774 0.082998 0.085206 0.117563 0.102364 0.110457 0.110466 0.114052 0.126164 0.133479 0.126617 0.131572 0.125109 0.126209 0.125108
qa: -0.0288 -0.0482 -0.2629 -0.3909 -0.2950 0.1290 -0.0298 -0.1256 -0.2723 -0.2534 -0.2520 0.3522 0.1020 0.0660 0.0339 -0.2951 -0.1153 0.2285 -0.1122 -0.1509 0.2365 -0.2043 -0.1645 -0.0941 -0.1164 -0.1416 0.1112 0.1002 0.0946 0.0925 0.0857 0.1038 0.0830 0.0852 0.1176 0.1024 0.1105 0.1105 0.1141 0.1262 0.1335 0.1266 0.1316 0.1251 0.1262 0.1251
va: 1.3223 1.2579 2.1214 2.1058 2.0906 3.7157 3.8520 3.8569 3.9132 3.8965 3.9134 4.2047 4.2004 3.8508 3.6375 4.0517 3.9740 3.7641 3.9684 3.9381 3.8214 4.0358 3.9460 3.9327 3.9465 3.9573 1.0280 1.0265 1.0064 1.0012 1.0010 1.0227 1.0022 1.0024 1.0167 1.0113 0.9930 1.0320 1.0200 1.0008 1.0031 1.0147 1.0046 0.9991 1.0000 1.0004
dispcorr: -0.024596576 hartree
energy: -1958.448435759929
dipole: -15.92586 15.78418 -0.14168 -11.48635 11.25405 -0.23230 -0.56516 0.71111 0.14595
magnitude: 0.30877 au
magnitude: 0.78484 debye
