program: Orca
programVersion: 5.0.3
elementType: Cl Cl O O O C C C C C C C C C C C C C C C C C C C C C H H H H H H H H H H H H H H H H H H H H
charge: 0
multiplicity: 1
keywords: wb97x-d3
keywords: def2-TZVPP
keywords: def2/J RIJCOSX
keywords: DEFGRID2
keywords: scfconv7
keywords: smallprint printgap noloewdin
keywords: NOSOSCF
formula: C21H20Cl2O3
InChI: InChI=1/C21H20Cl2O3/c1-21(2)17(12-18(22)23)19(21)20(24)25-13-14-7-6-10-16(11-14)26-15-8-4-3-5-9-15/h3-12,17,19H,13H2,1-2H3
46 atoms
Cl 0.961362 -0.418153 -1.76999
Cl 3.578813 -0.676595 -2.969575
O  -0.654728 -1.823498 1.567146
O  -1.53225 -3.152025 -0.00815
O  -0.505527 3.363442 0.384847
C  1.351693 -4.419345 -0.073193
C  1.172162 -3.404583 -1.149776
C  0.837884 -3.037202 0.28048
C  2.750633 -4.722062 0.40898
C  0.434162 -5.616127 -0.044817
C  2.300524 -2.734266 -1.829628
C  -0.574981 -2.715665 0.576049
C  2.281876 -1.445889 -2.147131
C  -1.892131 -1.125911 1.729785
C  -1.941589 0.019421 0.758919
C  -1.250018 1.188476 1.051155
C  -2.590275 -0.105297 -0.465705
C  -1.211155 2.222401 0.127683
C  -2.535179 0.928175 -1.38765
C  -1.849205 2.098039 -1.096677
C  -0.85246 4.13845 1.45051
C  0.135727 4.970437 1.962657
C  -2.131431 4.152129 1.994138
C  -0.160252 5.816568 3.017996
C  -2.409353 5.000807 3.055978
C  -1.431449 5.834721 3.574664
H  0.293544 -3.55002 -1.77338
H  1.552507 -2.399255 0.787464
H  3.39595 -3.843155 0.401676
H  2.728531 -5.104763 1.429934
H  3.218051 -5.483709 -0.21815
H  0.338152 -6.004734 0.970495
H  -0.562762 -5.389349 -0.412439
H  0.848235 -6.412936 -0.664748
H  3.170588 -3.313762 -2.114426
H  -2.742635 -1.79697 1.606429
H  -1.883277 -0.767402 2.758594
H  -0.731981 1.295299 1.997425
H  -3.117805 -1.018812 -0.704215
H  -3.032976 0.824997 -2.342649
H  -1.803312 2.910869 -1.809394
H  1.12576 4.9502 1.526391
H  -2.909434 3.515365 1.594126
H  0.613063 6.463255 3.411414
H  -3.406948 5.009792 3.475163
H  -1.65716 6.494444 4.401198
totalener: -1958.42320050 hartree
nucrepener: 2572.89261393 hartree
electener: -4531.31581443 hartree
oneelecener: -7799.31850457 hartree
twoeener: 3268.00269013 hartree
kineticenergy: 1952.63654807 hartree
xcener: -143.515785672061 hartree
chargesum: -0.0000000
charge: -0.031928 -0.046581 -0.258522 -0.394907 -0.299653 0.130446 -0.037302 -0.116452 -0.271940 -0.251626 -0.250502 0.345944 0.106954 0.050292 -0.021550 -0.160424 -0.107569 0.182217 -0.122494 -0.170828 0.241299 -0.205849 -0.147373 -0.093559 -0.133811 -0.146994 0.109864 0.100154 0.085793 0.094260 0.093046 0.085784 0.102684 0.083644 0.117619 0.110771 0.105689 0.116055 0.126949 0.126477 0.126876 0.125398 0.128263 0.124239 0.125266 0.123881
qa: -0.0319 -0.0466 -0.2585 -0.3949 -0.2997 0.1304 -0.0373 -0.1165 -0.2719 -0.2516 -0.2505 0.3459 0.1070 0.0503 -0.0215 -0.1604 -0.1076 0.1822 -0.1225 -0.1708 0.2413 -0.2058 -0.1474 -0.0936 -0.1338 -0.1470 0.1099 0.1002 0.0858 0.0943 0.0930 0.0858 0.1027 0.0836 0.1176 0.1108 0.1057 0.1161 0.1269 0.1265 0.1269 0.1254 0.1283 0.1242 0.1253 0.1239
va: 1.3258 1.2598 2.1231 2.0985 2.1007 3.7123 3.8590 3.8485 3.9130 3.8948 3.9107 4.2145 4.1990 3.8630 3.6735 3.9957 3.9173 3.8569 3.9403 4.0088 3.8156 4.0204 3.9014 3.9457 3.9691 3.9583 1.0292 1.0269 1.0012 1.0066 1.0007 1.0025 1.0222 1.0023 1.0169 1.0131 0.9957 1.0150 1.0206 1.0011 1.0108 1.0141 1.0078 0.9986 1.0003 1.0005
dispcorr: -0.024732186 hartree
energy: -1958.447932686760
dipole: -10.34958 10.43924 0.08966 -11.59112 11.18850 -0.40262 19.03602 -18.48111 0.55492
magnitude: 0.69143 au
magnitude: 1.75748 debye
