program: Orca
programVersion: 5.0.3
elementType: Cl Cl O O O C C C C C C C C C C C C C C C C C C C C C H H H H H H H H H H H H H H H H H H H H
charge: 0
multiplicity: 1
keywords: wb97x-d3
keywords: def2-TZVPP
keywords: def2/J RIJCOSX
keywords: DEFGRID2
keywords: scfconv7
keywords: smallprint printgap noloewdin
keywords: NOSOSCF
formula: C21H20Cl2O3
InChI: InChI=1/C21H20Cl2O3/c1-21(2)17(12-18(22)23)19(21)20(24)25-13-14-7-6-10-16(11-14)26-15-8-4-3-5-9-15/h3-12,17,19H,13H2,1-2H3
46 atoms
Cl 0.925361 -0.449163 -1.802347
Cl 3.53369 -0.693841 -3.025137
O  -0.624272 -1.815241 1.568728
O  -1.516192 -3.174514 0.027341
O  -0.519326 3.384343 0.432084
C  1.372063 -4.424892 -0.064736
C  1.171163 -3.424198 -1.150983
C  0.856809 -3.041323 0.280294
C  2.780834 -4.716297 0.395381
C  0.459837 -5.624827 -0.000863
C  2.286092 -2.752995 -1.852367
C  -0.55372 -2.723335 0.591658
C  2.251556 -1.468196 -2.183966
C  -1.864139 -1.125647 1.745858
C  -1.92633 0.026974 0.784658
C  -1.245082 1.200244 1.083628
C  -2.578427 -0.093666 -0.438549
C  -1.218969 2.241373 0.167955
C  -2.538623 0.948542 -1.35159
C  -1.862307 2.12236 -1.053838
C  -0.891366 4.171162 1.480072
C  0.078559 5.027459 1.987184
C  -2.175316 4.172742 2.011876
C  -0.240948 5.886444 3.02499
C  -2.476848 5.035065 3.056596
C  -1.517765 5.893922 3.569348
H  0.284598 -3.580196 -1.760436
H  1.575645 -2.393069 0.767929
H  3.422715 -3.835082 0.366246
H  2.780042 -5.08856 1.420776
H  3.239385 -5.482688 -0.232987
H  -0.537606 -5.415314 -0.378784
H  0.880469 -6.440596 -0.591774
H  0.362612 -5.978818 1.027134
H  3.159535 -3.326738 -2.139368
H  -2.711897 -1.800319 1.622202
H  -1.851067 -0.775306 2.777629
H  -0.724031 1.30442 2.028409
H  -3.098369 -1.010151 -0.682632
H  -3.040701 0.849168 -2.304623
H  -1.827374 2.941617 -1.759868
H  1.072981 5.015771 1.560603
H  -2.939632 3.516831 1.616424
H  0.518119 6.552204 3.414277
H  -3.478391 5.035048 3.466574
H  -1.76175 6.563879 4.382447
totalener: -1958.42322499 hartree
nucrepener: 2568.44837390 hartree
electener: -4526.87159889 hartree
oneelecener: -7790.41778252 hartree
twoeener: 3263.54618363 hartree
kineticenergy: 1952.62882567 hartree
xcener: -143.514175456799 hartree
chargesum: 0.0000000
charge: -0.032336 -0.046519 -0.257971 -0.394491 -0.299576 0.129878 -0.037431 -0.114601 -0.272184 -0.250900 -0.250910 0.343908 0.107185 0.048830 -0.021666 -0.156162 -0.109038 0.178154 -0.125450 -0.165208 0.242948 -0.205891 -0.147916 -0.093145 -0.134450 -0.147293 0.110013 0.100176 0.085530 0.094138 0.093253 0.102694 0.082785 0.086615 0.117715 0.111078 0.105508 0.115796 0.127443 0.126588 0.127235 0.125134 0.127660 0.124006 0.125214 0.123651
qa: -0.0323 -0.0465 -0.2580 -0.3945 -0.2996 0.1299 -0.0374 -0.1146 -0.2722 -0.2509 -0.2509 0.3439 0.1072 0.0488 -0.0217 -0.1562 -0.1090 0.1782 -0.1254 -0.1652 0.2429 -0.2059 -0.1479 -0.0931 -0.1345 -0.1473 0.1100 0.1002 0.0855 0.0941 0.0933 0.1027 0.0828 0.0866 0.1177 0.1111 0.1055 0.1158 0.1274 0.1266 0.1272 0.1251 0.1277 0.1240 0.1252 0.1237
va: 1.3252 1.2598 2.1228 2.0992 2.1003 3.7120 3.8600 3.8460 3.9132 3.8947 3.9109 4.2162 4.1981 3.8636 3.6741 4.0017 3.9138 3.8647 3.9379 4.0084 3.8140 4.0201 3.9010 3.9463 3.9699 3.9584 1.0291 1.0268 1.0011 1.0066 1.0006 1.0219 1.0025 1.0022 1.0168 1.0137 0.9957 1.0150 1.0202 1.0013 1.0103 1.0143 1.0084 0.9987 1.0003 1.0006
dispcorr: -0.024658426 hartree
energy: -1958.447883416352
dipole: -10.10993 10.20598 0.09604 -11.35795 10.95975 -0.39821 19.33590 -18.79140 0.54450
magnitude: 0.68138 au
magnitude: 1.73193 debye
