program: Orca
programVersion: 5.0.3
elementType: Cl Cl O O O C C C C C C C C C C C C C C C C C C C C C H H H H H H H H H H H H H H H H H H H H
charge: 0
multiplicity: 1
keywords: wb97x-d3
keywords: def2-TZVPP
keywords: def2/J RIJCOSX
keywords: DEFGRID2
keywords: scfconv7
keywords: smallprint printgap noloewdin
keywords: NOSOSCF
formula: C21H20Cl2O3
InChI: InChI=1/C21H20Cl2O3/c1-21(2)17(12-18(22)23)19(21)20(24)25-13-14-7-6-10-16(11-14)26-15-8-4-3-5-9-15/h3-12,17,19H,13H2,1-2H3
46 atoms
Cl 3.9076 -2.700345 -2.918022
Cl 5.426776 -0.67374 -1.536634
O  -1.533031 -1.022944 -0.157754
O  -0.946224 -2.784831 -1.400562
O  -3.061841 3.656349 0.805364
C  1.350662 -2.966053 0.746625
C  1.867381 -2.388718 -0.539593
C  0.631915 -1.796577 0.107585
C  2.073734 -2.674613 2.040764
C  0.758578 -4.353858 0.705768
C  3.098582 -1.592139 -0.600083
C  -0.672143 -1.950647 -0.579782
C  4.015319 -1.657018 -1.558015
C  -2.82545 -1.005982 -0.752858
C  -3.581044 0.1754 -0.21677
C  -2.928197 1.369144 0.06356
C  -4.957571 0.089504 -0.04901
C  -3.650843 2.458723 0.530297
C  -5.673791 1.192633 0.389951
C  -5.02719 2.378935 0.691604
C  -1.80613 3.692474 1.339642
C  -1.41769 2.845738 2.371422
C  -0.930209 4.649925 0.849761
C  -0.14152 2.958723 2.899487
C  0.340209 4.758805 1.395058
C  0.744008 3.910894 2.415264
H  1.661054 -2.990782 -1.41698
H  0.755576 -0.847857 0.618552
H  2.935366 -3.334297 2.15485
H  2.431105 -1.648076 2.113423
H  1.409694 -2.84471 2.889367
H  0.010844 -4.478697 1.49124
H  0.288135 -4.587348 -0.245706
H  1.544817 -5.090272 0.879237
H  3.289056 -0.88285 0.195926
H  -2.732916 -0.940259 -1.841059
H  -3.35793 -1.934925 -0.533388
H  -1.857578 1.448824 -0.071099
H  -5.472602 -0.839938 -0.258377
H  -6.745585 1.122046 0.518882
H  -5.575751 3.238716 1.052519
H  -2.103666 2.104392 2.760226
H  -1.249054 5.305063 0.049736
H  0.157783 2.298603 3.702951
H  1.019885 5.508096 1.011351
H  1.737473 3.99481 2.834438
totalener: -1958.42676205 hartree
nucrepener: 2460.47488330 hartree
electener: -4418.90164535 hartree
oneelecener: -7573.76400867 hartree
twoeener: 3154.86236332 hartree
kineticenergy: 1952.61110242 hartree
xcener: -143.512991516705 hartree
chargesum: 0.0000000
charge: -0.040257 -0.048833 -0.267729 -0.378497 -0.298522 0.063067 0.042994 -0.057177 -0.246859 -0.247859 -0.202798 0.320055 0.051176 0.065466 0.050575 -0.172325 -0.198135 0.225937 -0.086773 -0.212642 0.241016 -0.151373 -0.207824 -0.128990 -0.091465 -0.144018 0.085359 0.077007 0.099335 0.072108 0.092935 0.085079 0.103870 0.088394 0.095336 0.108267 0.097000 0.120860 0.108956 0.124759 0.126342 0.131841 0.125828 0.126109 0.126159 0.126242
qa: -0.0403 -0.0488 -0.2677 -0.3785 -0.2985 0.0631 0.0430 -0.0572 -0.2469 -0.2479 -0.2028 0.3201 0.0512 0.0655 0.0506 -0.1723 -0.1981 0.2259 -0.0868 -0.2126 0.2410 -0.1514 -0.2078 -0.1290 -0.0915 -0.1440 0.0854 0.0770 0.0993 0.0721 0.0929 0.0851 0.1039 0.0884 0.0953 0.1083 0.0970 0.1209 0.1090 0.1248 0.1263 0.1318 0.1258 0.1261 0.1262 0.1262
va: 1.2870 1.2561 2.1332 2.1269 2.1092 3.7721 3.8216 3.8577 3.9108 3.9116 3.9241 4.2513 4.2459 3.8406 3.7357 3.9130 4.0213 3.8553 3.9544 4.0423 3.8183 3.9348 4.0360 3.9387 3.9354 3.9545 1.0515 1.0296 1.0028 1.0102 1.0043 1.0020 1.0218 1.0011 1.0314 0.9948 1.0035 1.0294 1.0126 0.9996 1.0127 1.0038 1.0135 1.0000 0.9987 0.9999
dispcorr: -0.021176375 hartree
energy: -1958.447938423820
dipole: -23.95239 23.62429 -0.32810 -0.28236 0.36138 0.07902 22.96418 -21.88862 1.07556
magnitude: 1.12726 au
magnitude: 2.86528 debye
