program: Orca
programVersion: 5.0.3
elementType: Cl Cl O O O C C C C C C C C C C C C C C C C C C C C C H H H H H H H H H H H H H H H H H H H H
charge: 0
multiplicity: 1
keywords: wb97x-d3
keywords: def2-TZVPP
keywords: def2/J RIJCOSX
keywords: DEFGRID2
keywords: scfconv7
keywords: smallprint printgap noloewdin
keywords: NOSOSCF
formula: C21H20Cl2O3
InChI: InChI=1/C21H20Cl2O3/c1-21(2)17(12-18(22)23)19(21)20(24)25-13-14-7-6-10-16(11-14)26-15-8-4-3-5-9-15/h3-12,17,19H,13H2,1-2H3
46 atoms
Cl 1.510723 0.169516 1.292699
Cl 4.169435 0.649618 0.311098
O  -1.426842 -2.05189 1.077296
O  -1.622453 -2.650083 -1.067839
O  -1.699423 2.616978 -0.952218
C  1.359492 -3.444193 -0.971868
C  1.347805 -1.951522 -1.113731
C  0.535462 -2.607892 -0.020026
C  2.578837 -4.086789 -0.351465
C  0.729486 -4.293804 -2.048733
C  2.545217 -1.131457 -0.83443
C  -0.938049 -2.467352 -0.099396
C  2.701362 -0.234041 0.130207
C  -2.808358 -1.726955 1.118284
C  -3.161057 -0.489884 0.334151
C  -2.22441 0.510664 0.107244
C  -4.457526 -0.341821 -0.140829
C  -2.586311 1.642298 -0.612442
C  -4.81327 0.801187 -0.839162
C  -3.884489 1.798247 -1.080224
C  -0.619676 2.899371 -0.166333
C  -0.743839 3.127125 1.198539
C  0.611174 3.030011 -0.791889
C  0.375876 3.490265 1.930758
C  1.721638 3.40053 -0.048974
C  1.610413 3.629301 1.313528
H  0.756246 -1.587223 -1.950976
H  0.933363 -2.530952 0.984088
H  3.343623 -4.273245 -1.107792
H  3.027598 -3.470369 0.427543
H  2.31672 -5.047398 0.094354
H  -0.095623 -3.801868 -2.554532
H  1.483457 -4.549394 -2.795484
H  0.352619 -5.228612 -1.630562
H  3.382891 -1.260212 -1.51136
H  -3.414564 -2.569253 0.775611
H  -3.020336 -1.574157 2.177892
H  -1.208165 0.401698 0.463107
H  -5.186911 -1.126279 0.018808
H  -5.823276 0.913079 -1.210647
H  -4.149203 2.685728 -1.639385
H  -1.707563 3.03287 1.682804
H  0.689883 2.849401 -1.855829
H  0.277405 3.670781 2.993161
H  2.681124 3.497807 -0.538775
H  2.480123 3.909491 1.891728
totalener: -1958.42023847 hartree
nucrepener: 2714.53373609 hartree
electener: -4672.95397456 hartree
oneelecener: -8082.70613585 hartree
twoeener: 3409.75216129 hartree
kineticenergy: 1952.63240368 hartree
xcener: -143.521888266418 hartree
chargesum: -0.0000000
charge: -0.028138 -0.056047 -0.270547 -0.364448 -0.298392 0.121880 -0.015299 -0.119374 -0.262170 -0.248054 -0.250542 0.309775 0.126831 0.051100 0.048985 -0.173132 -0.197078 0.285809 -0.074876 -0.236168 0.272917 -0.171826 -0.208461 -0.105996 -0.123910 -0.131978 0.104937 0.102299 0.089906 0.087312 0.095573 0.103526 0.080082 0.085655 0.113431 0.103733 0.107559 0.073110 0.102663 0.122627 0.123645 0.128297 0.122091 0.124760 0.125814 0.122118
qa: -0.0281 -0.0560 -0.2705 -0.3644 -0.2984 0.1219 -0.0153 -0.1194 -0.2622 -0.2481 -0.2505 0.3098 0.1268 0.0511 0.0490 -0.1731 -0.1971 0.2858 -0.0749 -0.2362 0.2729 -0.1718 -0.2085 -0.1060 -0.1239 -0.1320 0.1049 0.1023 0.0899 0.0873 0.0956 0.1035 0.0801 0.0857 0.1134 0.1037 0.1076 0.0731 0.1027 0.1226 0.1236 0.1283 0.1221 0.1248 0.1258 0.1221
va: 1.3187 1.2476 2.1150 2.1292 2.1154 3.7400 3.8343 3.8688 3.9111 3.8983 3.9376 4.2423 4.1469 3.8600 3.7170 3.9415 4.0269 3.7547 3.9476 4.0429 3.7736 3.9445 3.9893 3.9087 3.8723 3.9186 1.0261 1.0305 1.0033 1.0010 1.0053 1.0252 1.0015 1.0026 1.0230 1.0083 0.9854 1.0612 1.0107 0.9993 1.0149 1.0058 1.0152 1.0001 1.0068 1.0032
dispcorr: -0.028357767 hartree
energy: -1958.448596238439
dipole: -10.43567 10.73556 0.29989 -16.11951 15.63136 -0.48815 -7.14962 7.52247 0.37285
magnitude: 0.68355 au
magnitude: 1.73745 debye
