program: Orca
programVersion: 5.0.3
elementType: Cl Cl O O O C C C C C C C C C C C C C C C C C C C C C H H H H H H H H H H H H H H H H H H H H
charge: 0
multiplicity: 1
keywords: wb97x-d3
keywords: def2-TZVPP
keywords: def2/J RIJCOSX
keywords: DEFGRID2
keywords: scfconv7
keywords: smallprint printgap noloewdin
keywords: NOSOSCF
formula: C21H20Cl2O3
InChI: InChI=1/C21H20Cl2O3/c1-21(2)17(12-18(22)23)19(21)20(24)25-13-14-7-6-10-16(11-14)26-15-8-4-3-5-9-15/h3-12,17,19H,13H2,1-2H3
46 atoms
Cl 3.322853 -3.895186 -3.513867
Cl 5.417224 -2.175427 -2.524562
O  -1.086454 -1.104302 -0.135467
O  -1.107094 -3.10356 -1.13425
O  -1.792162 3.117643 2.192486
C  1.470968 -3.559507 0.594148
C  1.86277 -3.188344 -0.80612
C  0.877775 -2.321797 -0.043695
C  2.432404 -3.316538 1.734169
C  0.644906 -4.808787 0.783212
C  3.183929 -2.639793 -1.133768
C  -0.526552 -2.25786 -0.508109
C  3.872051 -2.877744 -2.243834
C  -2.440755 -0.889272 -0.49581
C  -2.888347 0.452889 0.010145
C  -2.114868 1.224807 0.862526
C  -4.13733 0.919497 -0.390469
C  -2.592317 2.44813 1.317404
C  -4.604213 2.137165 0.071229
C  -3.840465 2.913884 0.9296
C  -1.794896 4.481844 2.224644
C  -1.700051 5.244715 1.066605
C  -1.83422 5.092305 3.469296
C  -1.652025 6.625979 1.166203
C  -1.775143 6.475087 3.554919
C  -1.689963 7.247656 2.406602
H  1.407766 -3.800524 -1.576361
H  1.260992 -1.382662 0.33954
H  1.893631 -3.304644 2.682679
H  3.177879 -4.111723 1.784229
H  2.963096 -2.368344 1.656106
H  -0.01063 -5.01827 -0.057562
H  1.307821 -5.66571 0.912804
H  0.027534 -4.731298 1.680051
H  3.650015 -1.973078 -0.418852
H  -2.555541 -0.940953 -1.582304
H  -3.070769 -1.67774 -0.072428
H  -1.138834 0.894017 1.188577
H  -4.747969 0.328706 -1.062797
H  -5.578701 2.491719 -0.237483
H  -4.218256 3.861624 1.289672
H  -1.660357 4.765103 0.09695
H  -1.904161 4.482408 4.360379
H  -1.577515 7.219328 0.264355
H  -1.802951 6.94939 4.52707
H  -1.649105 8.326058 2.47672
totalener: -1958.42676972 hartree
nucrepener: 2367.97171104 hartree
electener: -4326.39848076 hartree
oneelecener: -7388.85748120 hartree
twoeener: 3062.45900044 hartree
kineticenergy: 1952.61114477 hartree
xcener: -143.514501227812 hartree
chargesum: 0.0000000
charge: -0.040239 -0.048339 -0.265886 -0.378634 -0.296827 0.068166 0.039679 -0.066058 -0.247924 -0.248443 -0.199098 0.319088 0.048892 0.071827 0.073675 -0.222102 -0.202426 0.220248 -0.118528 -0.160669 0.239366 -0.163899 -0.204403 -0.114474 -0.093672 -0.142369 0.085543 0.075540 0.092962 0.099278 0.073148 0.103953 0.088429 0.085039 0.095218 0.103228 0.106064 0.118410 0.112178 0.125650 0.131713 0.133800 0.124663 0.127046 0.125377 0.125809
qa: -0.0402 -0.0483 -0.2659 -0.3786 -0.2968 0.0682 0.0397 -0.0661 -0.2479 -0.2484 -0.1991 0.3191 0.0489 0.0718 0.0737 -0.2221 -0.2024 0.2202 -0.1185 -0.1607 0.2394 -0.1639 -0.2044 -0.1145 -0.0937 -0.1424 0.0855 0.0755 0.0930 0.0993 0.0731 0.1040 0.0884 0.0850 0.0952 0.1032 0.1061 0.1184 0.1122 0.1257 0.1317 0.1338 0.1247 0.1270 0.1254 0.1258
va: 1.2872 1.2565 2.1398 2.1265 2.1061 3.7566 3.8365 3.8577 3.9112 3.9146 3.9210 4.2528 4.2512 3.8282 3.7106 4.0519 4.0180 3.8695 3.9678 3.9326 3.8114 3.9523 4.0381 3.9440 3.9337 3.9585 1.0503 1.0309 1.0043 1.0023 1.0100 1.0228 1.0010 1.0021 1.0321 0.9970 0.9941 1.0377 1.0108 1.0012 1.0047 1.0030 1.0138 0.9998 0.9990 1.0004
dispcorr: -0.020353345 hartree
energy: -1958.447123069008
dipole: -25.16068 24.72957 -0.43111 12.00984 -11.32612 0.68372 25.48591 -24.65457 0.83134
magnitude: 1.15950 au
magnitude: 2.94722 debye
