program: Orca
programVersion: 5.0.3
elementType: Cl Cl O O O C C C C C C C C C C C C C C C C C C C C C H H H H H H H H H H H H H H H H H H H H
charge: 0
multiplicity: 1
keywords: wb97x-d3
keywords: def2-TZVPP
keywords: def2/J RIJCOSX
keywords: DEFGRID2
keywords: scfconv7
keywords: smallprint printgap noloewdin
keywords: NOSOSCF
formula: C21H20Cl2O3
InChI: InChI=1/C21H20Cl2O3/c1-21(2)17(12-18(22)23)19(21)20(24)25-13-14-7-6-10-16(11-14)26-15-8-4-3-5-9-15/h3-12,17,19H,13H2,1-2H3
46 atoms
Cl 1.314044 -0.105527 2.098127
Cl 4.12851 0.450087 1.765521
O  -1.351915 -1.815214 -0.330027
O  -1.080206 -3.700468 0.83916
O  -2.104923 3.112257 -0.096714
C  1.419336 -2.632659 -1.503325
C  1.43539 -1.395902 -0.664976
C  0.828211 -2.660968 -0.106067
C  2.699605 -3.412817 -1.681009
C  0.519751 -2.672035 -2.715874
C  2.676582 -0.849954 -0.075013
C  -0.619342 -2.802619 0.188799
C  2.705367 -0.254557 1.108941
C  -2.736466 -1.756428 -0.010235
C  -3.22125 -0.371659 -0.329421
C  -2.411137 0.725007 -0.057369
C  -4.490808 -0.17562 -0.854971
C  -2.863577 2.006446 -0.335763
C  -4.947069 1.112715 -1.097059
C  -4.139001 2.208431 -0.849691
C  -0.741847 2.989447 -0.142293
C  -0.00696 3.337834 0.978387
C  -0.105477 2.551265 -1.297886
C  1.377604 3.244004 0.944052
C  1.276273 2.457094 -1.317818
C  2.023195 2.799647 -0.198589
H  0.71911 -0.629432 -0.950819
H  1.426251 -3.201163 0.619233
H  3.291675 -3.003847 -2.50244
H  3.32205 -3.406163 -0.785705
H  2.481691 -4.454744 -1.919283
H  1.073806 -2.350653 -3.599316
H  0.163507 -3.686449 -2.902797
H  -0.347222 -2.023042 -2.619446
H  3.599479 -0.892595 -0.641278
H  -3.291064 -2.506523 -0.580327
H  -2.884474 -1.982733 1.049256
H  -1.42474 0.579624 0.364423
H  -5.124504 -1.024713 -1.078836
H  -5.93794 1.264134 -1.50424
H  -4.481869 3.21353 -1.056341
H  -0.519346 3.675006 1.869803
H  -0.68733 2.286868 -2.171813
H  1.951388 3.507468 1.822423
H  1.773233 2.115503 -2.216486
H  3.101181 2.716887 -0.216608
totalener: -1958.42140970 hartree
nucrepener: 2709.68474454 hartree
electener: -4668.10615424 hartree
oneelecener: -8072.31935839 hartree
twoeener: 3404.21320415 hartree
kineticenergy: 1952.62694336 hartree
xcener: -143.518108821563 hartree
chargesum: 0.0000000
charge: -0.038376 -0.052134 -0.275566 -0.351956 -0.300525 0.121965 -0.013597 -0.098829 -0.283594 -0.258856 -0.256610 0.330669 0.134352 0.039227 0.032177 -0.137035 -0.197793 0.232829 -0.079128 -0.213693 0.226040 -0.154669 -0.136125 -0.157625 -0.175031 -0.087660 0.092115 0.097818 0.091477 0.085828 0.097601 0.084415 0.098629 0.090028 0.118421 0.096882 0.114394 0.079167 0.108510 0.124201 0.125070 0.126436 0.132047 0.127101 0.128731 0.132670
qa: -0.0384 -0.0521 -0.2756 -0.3520 -0.3005 0.1220 -0.0136 -0.0988 -0.2836 -0.2589 -0.2566 0.3307 0.1344 0.0392 0.0322 -0.1370 -0.1978 0.2328 -0.0791 -0.2137 0.2260 -0.1547 -0.1361 -0.1576 -0.1750 -0.0877 0.0921 0.0978 0.0915 0.0858 0.0976 0.0844 0.0986 0.0900 0.1184 0.0969 0.1144 0.0792 0.1085 0.1242 0.1251 0.1264 0.1320 0.1271 0.1287 0.1327
va: 1.2978 1.2563 2.0853 2.1560 2.1097 3.7494 3.7898 3.8616 3.9241 3.8962 3.8932 4.2260 4.1730 3.8425 3.7463 3.8847 4.0151 3.8323 3.9545 4.0370 3.8163 3.9856 3.9047 3.9233 3.9145 3.8148 1.0174 1.0250 0.9998 1.0022 1.0056 1.0040 1.0010 1.0174 1.0161 1.0028 1.0018 1.0505 1.0126 0.9991 1.0136 1.0097 1.0032 1.0062 1.0007 1.0027
dispcorr: -0.029419876 hartree
energy: -1958.450829574350
dipole: -9.32804 9.67495 0.34691 -10.40747 10.52013 0.11266 -23.19281 22.11059 -1.08222
magnitude: 1.14203 au
magnitude: 2.90281 debye
