program: Orca
programVersion: 5.0.3
elementType: Cl Cl O O O C C C C C C C C C C C C C C C C C C C C C H H H H H H H H H H H H H H H H H H H H
charge: 0
multiplicity: 1
keywords: wb97x-d3
keywords: def2-TZVPP
keywords: def2/J RIJCOSX
keywords: DEFGRID2
keywords: scfconv7
keywords: smallprint printgap noloewdin
keywords: NOSOSCF
formula: C21H20Cl2O3
InChI: InChI=1/C21H20Cl2O3/c1-21(2)17(12-18(22)23)19(21)20(24)25-13-14-7-6-10-16(11-14)26-15-8-4-3-5-9-15/h3-12,17,19H,13H2,1-2H3
46 atoms
Cl 2.537341 -5.270233 -3.162469
Cl 4.744796 -3.504943 -3.7347
O  -0.756191 -0.78615 -0.185126
O  -1.017468 -3.000345 -0.347316
O  -2.609108 3.32478 2.56935
C  1.966927 -2.997199 0.641489
C  1.892786 -3.256582 -0.835609
C  1.180045 -2.056452 -0.245984
C  3.235973 -2.436759 1.239022
C  1.264792 -3.965541 1.562189
C  3.037855 -3.046449 -1.72905
C  -0.302268 -2.036707 -0.265851
C  3.384772 -3.838692 -2.736175
C  -2.176483 -0.612197 -0.200557
C  -2.450064 0.854973 -0.072516
C  -2.387264 1.461632 1.174954
C  -2.744751 1.621717 -1.192745
C  -2.632213 2.820506 1.305695
C  -2.988108 2.979457 -1.056006
C  -2.937499 3.588714 0.1874
C  -2.293339 4.63749 2.777826
C  -1.129845 5.195599 2.262841
C  -3.143984 5.389273 3.573365
C  -0.827242 6.517294 2.548267
C  -2.824268 6.70825 3.859601
C  -1.670377 7.279186 3.345142
H  1.22971 -4.067445 -1.114149
H  1.639724 -1.087578 -0.407077
H  3.704203 -1.674093 0.61791
H  3.025858 -1.979058 2.206718
H  3.967887 -3.230354 1.397732
H  0.381987 -4.414838 1.115031
H  1.949166 -4.770894 1.833704
H  0.959316 -3.468346 2.484793
H  3.657602 -2.172654 -1.570353
H  -2.59209 -1.008844 -1.129823
H  -2.628368 -1.170451 0.622755
H  -2.155823 0.879973 2.059128
H  -2.789305 1.157739 -2.169869
H  -3.228774 3.574877 -1.926625
H  -3.143151 4.646771 0.28215
H  -0.464616 4.601394 1.649345
H  -4.044208 4.93704 3.968223
H  0.079845 6.951601 2.149296
H  -3.487625 7.29273 4.483249
H  -1.426647 8.309375 3.566372
totalener: -1958.42701110 hartree
nucrepener: 2354.49875877 hartree
electener: -4312.92576987 hartree
oneelecener: -7361.94878378 hartree
twoeener: 3049.02301391 hartree
kineticenergy: 1952.62020117 hartree
xcener: -143.511363628191 hartree
chargesum: -0.0000000
charge: -0.040922 -0.049532 -0.252953 -0.383485 -0.297034 0.064833 0.045935 -0.078967 -0.245608 -0.248275 -0.203234 0.332883 0.051970 0.050512 0.025882 -0.203320 -0.148294 0.215519 -0.128274 -0.149825 0.225292 -0.158649 -0.194015 -0.115141 -0.098099 -0.136534 0.085800 0.077624 0.072164 0.093379 0.098423 0.103143 0.088434 0.084720 0.095406 0.096492 0.103773 0.110686 0.110923 0.127173 0.132561 0.133850 0.125649 0.127174 0.125712 0.126249
qa: -0.0409 -0.0495 -0.2530 -0.3835 -0.2970 0.0648 0.0459 -0.0790 -0.2456 -0.2483 -0.2032 0.3329 0.0520 0.0505 0.0259 -0.2033 -0.1483 0.2155 -0.1283 -0.1498 0.2253 -0.1586 -0.1940 -0.1151 -0.0981 -0.1365 0.0858 0.0776 0.0722 0.0934 0.0984 0.1031 0.0884 0.0847 0.0954 0.0965 0.1038 0.1107 0.1109 0.1272 0.1326 0.1339 0.1256 0.1272 0.1257 0.1262
va: 1.2863 1.2557 2.1384 2.1184 2.1045 3.7636 3.8121 3.8800 3.9101 3.9120 3.9254 4.2458 4.2461 3.8328 3.7653 4.0511 3.9818 3.8731 3.9819 3.9260 3.8209 3.9603 4.0342 3.9432 3.9337 3.9542 1.0523 1.0347 1.0101 1.0042 1.0028 1.0224 1.0014 1.0021 1.0310 1.0039 1.0006 1.0249 1.0113 1.0014 1.0049 1.0029 1.0131 0.9998 0.9992 1.0002
dispcorr: -0.020331016 hartree
energy: -1958.447342119340
dipole: -15.20018 15.27186 0.07167 24.54880 -23.17973 1.36907 28.06998 -27.45523 0.61474
magnitude: 1.50247 au
magnitude: 3.81896 debye
